agg,doi,genbank,ipg_id,name,pdb.0,pdb.1,pdb.2,pdb.3,pdb.4,pdb.5,seq,slug,states.0.brightness,states.0.em_max,states.0.ex_max,states.0.ext_coeff,states.0.lifetime,states.0.maturation,states.0.name,states.0.pka,states.0.qy,states.0.slug,states.1.brightness,states.1.em_max,states.1.ex_max,states.1.ext_coeff,states.1.lifetime,states.1.maturation,states.1.name,states.1.pka,states.1.qy,states.1.slug,switch_type,transitions.0.from_state,transitions.0.to_state,transitions.0.trans_wave,transitions.1.from_state,transitions.1.to_state,transitions.1.trans_wave,uniprot,uuid
m,10.1038/nbt.1952,,,Dreiklang,3ST3,3ST2,3ST4,,,,MVSKGEELFTGVVPILVELDGDVNGHKFSVSGEGEGDATYGKLTLKFICTTGKLPVPWPTLLTTIGYGLMCFARYPDHMKQHDFFKSAMPEGYVQERTIFFKDDGNYKTRAEVKFEGDTLVNRIELKGIDFKEDGNILGHKLEYNHDSHNVYIMADKQKNGIKVNFKIRHNIEDGSVQLADHYQQNTPIGDGPVLLPDNHYLSYQSALSKDPNEKRDHMVLLEFVTAAGITLGMDELYK,dreiklang,34.03,529,511,83000,,120.0,On,7.2,0.41,dreiklang_on,,,,,,,Off,,,dreiklang_off,ps,dreiklang_on,dreiklang_off,405,dreiklang_off,dreiklang_on,365,,JY7XC
m,10.1126/science.1102506,BAD72874,3892390,Dronpa,2IE2,2POX,2IOV,2GX0,,,MSVIKPDMKIKLRMEGAVNGHPFAIEGVGLGKPFEGKQSMDLKVKEGGPLPFAYDILTTVFCYGNRVFAKYPENIVDYFKQSFPEGYSWERSMNYEDGGICNATNDITLDGDCYIYEIRFDGVNFPANGPVMQKRTVKWEPSTEKLYVRDGVLKGDVNMALSLEGGGHYRCDFKTTYKAKKVVQLPDYHFVDHHIEIKSHDKDYSNVNLHEHAEAHSELPRQAK,dronpa,,,,,,,Off,,,dronpa_off,80.75,518,503,95000,3.6,40.0,On,,0.85,dronpa_on,ps,dronpa_on,dronpa_off,503,dronpa_off,dronpa_on,400,,7P38V
m,10.1016/j.chembiol.2017.12.005,BBC28144,174808012,Gamillus,5Y01,5Y00,,,,,MVSKGEEASGRALFQYPMTSKIELNGEINGKKFKVAGEGFTPSSGRFNMHAYCTTGDLPMSWVVIASPLQYGFHMFAHYPEDITHFFQECFPGSYTLDRTLRMEGDGTLTTHHEYSLEDGCVTSKTTLNASGFDPKGATMTKSFVKQLPNEVKITPHGPNGIRLTSTVLYLKEDGTIQIGTQDCIVTPVGGRKVTQPKAHFLHTQIIQKKDPNDTRDHIVQTELAVAGNLWHGMDELYK,gamillus,74.7,519,504,83000,,8.0,On,3.4,0.9,gamillus_on,,,,,,,Off,,,gamillus_off,ps,gamillus_on,gamillus_off,488,gamillus_off,gamillus_on,388,,21PQ5
t,10.1088/2050-6120/3/1/014004,,,IrisFP-M159A,4R6B,,,,,,MSAIKPDMKINLRMEGNVNGHHFVIDGDGTGKPFEGKQSMDLEVKEGGPLPFAFDILTTAFHYGNRVFAEYPDHIQDYFKQSFPKGYSWERSLTFEDGGICIARNDITMEGDTFYNKVRFHGVNFPANGPVMQKKTLKWEPSTEKMYVRDGVLTGDITAALLLEGNAHYRCDSRTTYKAKEKGVKLPGYHLVDHCIEILSHDKDYNKVKLYEHAVAHSGLPDNARR,irisfp-m159a,11.3,513,484,62800,,,Green,4.7,0.18,irisfp-m159a_green,,,,,,,Green (off),,,irisfp-m159a_green-off,ps,irisfp-m159a_green,irisfp-m159a_green-off,488,irisfp-m159a_green-off,irisfp-m159a_green,405,,T44HU
m,10.1074/jbc.m109.086314,,,Padron0.9,3ZUL,,,,,,MSVIKPDMKIKLRMEGAVNGHPFAIEGVGLGKPFEGKQSMDLKVKEGGPLPFAYDILTMAFCYGNRVFAKYPENIVDYFKQSFPEGYSWERSMIYEDGGICNATNDITLDGDCYICEIRFDGVNFPANGPVMQKRTVKWELSTEKLYVRDGVLKSDGNYALSLEGGGHYRCDFKTTYKAKKVVQLPDYHSVDHHIEIISHDKDYSNVNLHEHAEAHSELPRQAK,padron09,21.96,522,505,36000,,,On,,0.61,padron09_on,,,,,,,Off,,,padron09_off,ps,padron09_off,padron09_on,488,padron09_on,padron09_off,405,,FM4GO
m,10.7554/elife.00248,,,rsEGFP2,5DTX,5O8A,5O8C,5O89,5DTY,5O8B,MVSKGEELFTGVVPILVELDGDVNGHKFSVSGEGEGDATYGKLTLKFICTTGKLPVPWPTLVTTLAYGVLCFSRYPDHMKQHDFFKSAMPEGYVQERTIFFKDDGNYKTRAEVKFEGDTLVNRIELKGIDFKEDGNILGHKLEYNYNSHNVYIMADKQKNGIKSNFKIRHNIEDGSVQLADHYQQNTPIGDGPVLLPDNHYLSTQSKLSKDPNEKRDHMVLLEFVTAAGITLGMDELYK,rsegfp2,,,,,,,Off,,,rsegfp2_off,18.39,503,478,61300,,20.0,On,5.8,0.3,rsegfp2_on,ps,rsegfp2_off,rsegfp2_on,408,rsegfp2_on,rsegfp2_off,503,,4Z6XY
m,10.1038/srep18459,,,rsFolder,5DTZ,5DU0,,,,,MVSKGEELFTGVVPILVELDGDVNGHKFSVRGEGEGDATNGKLTLKFICTTGKLPVPWPTLVTTLAYGVLCFSRYPDHMKRHDFFKSAMPEGYVQERTISFKDDGTYKTRAEVKFEGDTLVNRIELKGIDFKEDGNILGHKLEYNFNSHNVYITADKQKNGIKSNFKIRHNVEDGSVQLADHYQQNTPIGDGPVLLPDNHYLSTQSKLSKDPNEKRDHMVLLEFVTAAGITHGMDELYK,rsfolder,12.9,503,477,51600,,,Green,5.5,0.25,rsfolder_green,,,,,,,Green (off),,,rsfolder_green-off,ps,rsfolder_green,rsfolder_green-off,488,rsfolder_green-off,rsfolder_green,405,,BKD94
m,10.1016/j.jmb.2012.01.044,,,rsTagRFP,3U8C,,,,,,MVSKGEELIKENMHMKLYMEGTVNNHHFKCTSEGEGKPYEGTQTMRIKVVEGGPLPFAFDILATSFMYGSRTFINHTQGIPDFWKQSFPEGFTWERVTTYEDGGVLTATQDTSLQDGCLIYNVKLRGVNFPSNGPVMQKKTLGWEAATEMLYPADGGLEGRGDMALKLVGGGHLICNLKTTYRSKNPAKNLKMPGVYFVDHRLERIKEADKETYVEQHEVAVARYCDLPSKLGHKLN,rstagrfp,0.02,,,15300,,,OFF,,0.0013,rstagrfp_off,4.05,585,567,36800,,,ON,6.6,0.11,rstagrfp_on,ps,rstagrfp_off,rstagrfp_on,440,rstagrfp_on,rstagrfp_off,567,,3FC3D
m,10.1021/acschembio.8b00200,LC320161,,SPOON,,,,,,,MVSKGEELFTGVVPILVELDGDVNGHKFSVSGEGEGDATYGKLTLKFVCTTGKLPVPWPSLLTTIGYGLMCFARYPDHMKQHDFFKSAMPEGYVQERTIFFKDDGNYKTRAEVKFEGDTLVNRIELKGIDFKEDGNILGHKLEYNHDSHNVYITADKQKNGIKVNFKIRHNIEDGSVQLADHYQQNTPIGDGPVLLPDNHYLSYQSALGKDPNEKRDHMVLLEFVTAAGITLGTDELYK,spoon,27.0,527,510,54000,,112.0,on,7.2,0.5,spoon_on,,,,,,,off,,,spoon_off,ps,spoon_off,spoon_on,339,spoon_on,spoon_off,411,,MRKZY
