agg,doi,genbank,ipg_id,name,pdb.0,pdb.1,seq,slug,states.0.brightness,states.0.em_max,states.0.ex_max,states.0.ext_coeff,states.0.lifetime,states.0.maturation,states.0.name,states.0.pka,states.0.qy,states.0.slug,states.1.brightness,states.1.em_max,states.1.ex_max,states.1.ext_coeff,states.1.lifetime,states.1.maturation,states.1.name,states.1.pka,states.1.qy,states.1.slug,switch_type,transitions.0.from_state,transitions.0.to_state,transitions.0.trans_wave,transitions.1.from_state,transitions.1.to_state,transitions.1.trans_wave,uniprot,uuid
m,10.1038/s41598-018-31687-w,,,BrUSLEE,,,MVSKGEELFTGVVPILVELDGDVNGHKFSVSGEGEGDATYGKLTLKFICTTGKLPVPWPTLVTTLGYGVQCFSRYPDHMKQHDFFKSAMPEGYVQERTIFFKDDGNYKTRAEVKFEGDTLVNRIELKGIDFKEDGNILGHKLEYNMNSHNVYIMADKQKNGIKVNYKIRHNIEDGSVQLADHYQQNTPIGDGPVLLPDNHYLSTQSALSKDPNEKRDHMVLLEFVTAAGITLGMDELYK,bruslee,25.8,509,487,86000,0.82,,default,,0.3,bruslee_default,,,,,,,,,,,b,,,,,,,,1K2R7
m,10.1016/j.chembiol.2017.12.005,BBC28144,174808012,Gamillus,5Y01,5Y00,MVSKGEEASGRALFQYPMTSKIELNGEINGKKFKVAGEGFTPSSGRFNMHAYCTTGDLPMSWVVIASPLQYGFHMFAHYPEDITHFFQECFPGSYTLDRTLRMEGDGTLTTHHEYSLEDGCVTSKTTLNASGFDPKGATMTKSFVKQLPNEVKITPHGPNGIRLTSTVLYLKEDGTIQIGTQDCIVTPVGGRKVTQPKAHFLHTQIIQKKDPNDTRDHIVQTELAVAGNLWHGMDELYK,gamillus,74.7,519,504,83000,,8.0,On,3.4,0.9,gamillus_on,,,,,,,Off,,,gamillus_off,ps,gamillus_on,gamillus_off,488,gamillus_off,gamillus_on,388,,21PQ5
m,10.1016/j.chembiol.2013.08.008,AGX93076,44320375,mPapaya,,,MVSKGEGQSKHGLKEEMTVKYHMEGCVNGHKFVITGEGIGNPFKGKQTANLCVIEGGPLPFSEDILSPGFKYGDRIFTEYPQDIVDYFKNSCPAGYTWERSYLFEDGAVCRCNVDITVSEKENCIYHKSIFRGVNFPADGPVMKKMTTNWEASTEKIVPVPKQGILKGKVKMCLLLKDGGRYHCQFDTVYKAKSVPSKMPEWHFIQHKLLREDRSDAKNQKWQLTEHAIAGMDELYK,mpapaya,35.69,541,530,43000,,,default,6.8,0.83,mpapaya_default,,,,,,,,,,,b,,,,,,,,5LCAQ
m,10.1038/nmeth.4074,APD76537,129830966,mScarlet-H,,,MVSKGEAVIKEFMRFKVHMEGSMNGHEFEIEGEGEGRPYEGTQTAKLKVTKGGPLPFSWDILSPQFMYGSRAFTKHPADIPDYYKQSFPEGFKWERVMNFEDGGAVTVTQDTSLEDGTLIYKVKLRGTNFPPDGPVMQKKTMGWEASTERLYPEDGVLKGDIKHALRLKDGGRYLADFKTTYKAKKPVQMPGAYNVDRKLDITSHNEDYTVVEQYERSEGRHSTGGMDELYK,mscarlet-h,14.8,592,551,74000,1.3,264.0,default,4.8,0.2,mscarlet-h_default,,,,,,,,,,,b,,,,,,,,588N2
m,10.1038/nmeth.4074,APD76536,129830965,mScarlet-I,,,MVSKGEAVIKEFMRFKVHMEGSMNGHEFEIEGEGEGRPYEGTQTAKLKVTKGGPLPFSWDILSPQFMYGSRAFIKHPADIPDYYKQSFPEGFKWERVMNFEDGGAVTVTQDTSLEDGTLIYKVKLRGTNFPPDGPVMQKKTMGWEASTERLYPEDGVLKGDIKMALRLKDGGRYLADFKTTYKAKKPVQMPGAYNVDRKLDITSHNEDYTVVEQYERSEGRHSTGGMDELYK,mscarlet-i,56.16,593,569,104000,3.1,36.0,default,5.4,0.54,mscarlet-i_default,,,,,,,,,,,b,,,,,,,,6VVTK
m,10.1371/journal.pone.0028674,,,mTagBFP2,,,MVSKGEELIKENMHMKLYMEGTVDNHHFKCTSEGEGKPYEGTQTMRIKVVEGGPLPFAFDILATSFLYGSKTFINHTQGIPDFFKQSFPEGFTWERVTTYEDGGVLTATQDTSLQDGCLIYNVKIRGVNFTSNGPVMQKKTLGWEAFTETLYPADGGLEGRNDMALKLVGGSHLIANAKTTYRSKKPAKNLKMPGVYYVDYRLERIKEANNETYVEQHEVAVARYCDLPSKLGHKLN,mtagbfp2,32.38,454,399,50600,2.6,12.0,default,2.7,0.64,mtagbfp2_default,,,,,,,,,,,b,,,,,,,,ZO7NN
m,10.1371/journal.pone.0171257,,,RDSmCherry1,,,MVSKGEEDNMAIIKEFMRFKSHMEGSVNGHEFEIEGEGEGRPYEGTQTCKLKVTKGGPLPFAWDILSPQFMYGSKAYVKHPADIPDYLKLSFPEGFKWERVMNFEDGGVVTVTQDSSLQDGEFIYKVKLRGTNFPSDGPVMQKKTMGWEPSSERMYPEDGALKGEGKGRLKLKDGGHYDAEVKTTYKAKKPVQLPGAYNCNIKLDITSHNEDYTIVEQYERAEGRHSTGGMDELYK,rdsmcherry1,4.99,630,600,55400,,,default,5.6,0.09,rdsmcherry1_default,,,,,,,,,,,b,,,,,,,,CC2YL
m,10.1038/nmeth.1317,BAH29934,16773179,Sirius,,,MVSKGEELFTGVVPILVELDGDVNGHRFSVSGEGEGDATYGKLTLKLICTTGKLPVPWPTLVTTLQFGVLCFARYPDHMKQHDFFKSAMPEGYVQERTIFFKDDGNYKTRAEVKFEGDTLVNRIELKGIDFKEDGNILGHKLEYNGISSNVYITADKQKNGIKAHFKIRHNIEDGGVQLADHYQQNTPIGDGPVLLPDNHYLSVQSKLSKDPNEKRDHMVLLESVTAAGITLGMDELYK,sirius,3.6,424,355,15000,,,default,3.0,0.24,sirius_default,,,,,,,,,,,b,,,,,,,,BU5R3
td,10.1038/nmeth.3935,KX449135,,TDsmURFP,,,MAKTSEQRVNIATLLTENKKKIVDKASQDLWRRHPDLIAPGGIAFSQRDRALCLRDYGWFLHLITFCLLAGDKGPIESIGLISIREMYNSLGVPVPAMMESIRCLKEASLSLLDEEDANETAPYFDYIIKAMSGHGTGSTGSGSSGTASSEDNNMAMAKTSEQRVNIATLLTENKKKIVDKASQDLWRRHPDLIAPGGIAFSQRDRALCLRDYGWFLHLITFCLLAGDKGPIESIGLISIREMYNSLGVPVPAMMESIRCLKEASLSLLDEEDANETAPYFDYIIKAMS,tdsmurfp,30.6,670,642,170000,,,default,,0.18,tdsmurfp_default,,,,,,,,,,,b,,,,,,,,MZOGH
