agg,doi,genbank,ipg_id,name,pdb.0,seq,slug,states.0.brightness,states.0.em_max,states.0.ex_max,states.0.ext_coeff,states.0.lifetime,states.0.maturation,states.0.name,states.0.pka,states.0.qy,states.0.slug,states.1.brightness,states.1.em_max,states.1.ex_max,states.1.ext_coeff,states.1.lifetime,states.1.maturation,states.1.name,states.1.pka,states.1.qy,states.1.slug,switch_type,transitions.0.from_state,transitions.0.to_state,transitions.0.trans_wave,transitions.1.from_state,transitions.1.to_state,transitions.1.trans_wave,uniprot,uuid
m,10.1038/nbt1191,,,Dendra,,MNLIKEDMRVKVHMEGNVNGHAFVIEGEGKGKPYEGTQTANLTVKEGAPLPFSYDILTTAVHYGNRVFTKYPEDIPDYFKQSFPEGYSWERTMTFEDKGICTIRSDISLEGDCFFQNVRFKGTNFPPNGPVMQKKTLKWEPSTEKLHVRDGLLVGNINMALLLEGGGHYLCDFKTTYKAKKVVQLPDAHFVDHRIEILGNDSDYNKVKLYEHAVARYSPLPSQAW,dendra,14.7,505,488,21000,,,Green,6.6,0.7,dendra_green,14.4,575,556,20000,,,Red,6.9,0.72,dendra_red,pc,dendra_green,dendra_red,405,,,,,GJDTN
m,10.1038/nbt1191,,,Dendra2,2VZX,MNTPGINLIKEDMRVKVHMEGNVNGHAFVIEGEGKGKPYEGTQTANLTVKEGAPLPFSYDILTTAVHYGNRVFTKYPEDIPDYFKQSFPEGYSWERTMTFEDKGICTIRSDISLEGDCFFQNVRFKGTNFPPNGPVMQKKTLKWEPSTEKLHVRDGLLVGNINMALLLEGGGHYLCDFKTTYKAKKVVQLPDAHFVDHRIEILGNDSDYNKVKLYEHAVARYSPLPSQVW,dendra2,22.5,507,490,45000,3.3,,Green,6.6,0.5,dendra2_green,19.25,573,553,35000,4.4,,Red,6.9,0.55,dendra2_red,pc,dendra2_green,dendra2_red,480,dendra2_green,dendra2_red,405,,GE6KO
m,10.1021/jacs.5b09923,,,Dendra2-T69A,,MNTPGINLIKEDMRVKVHMEGNVNGHAFVIEGEGKGKPYEGTQTANLTVKEGAPLPFSYDILTTAVHYGNRVFAKYPEDIPDYFKQSFPEGYSWERTMTFEDKGICTIRSDISLEGDCFFQNVRFKGTNFPPNGPVMQKKTLKWEPSTEKLHVRDGLLVGNINMALLLEGGGHYLCDFKTTYKAKKVVQLPDAHFVDHRIEILGNDSDYNKVKLYEHAVARYSPLPSQVW,dendra2-t69a,23.8,518,502,42500,3.0,,Green,6.0,0.56,dendra2-t69a_green,22.66,578,563,35400,4.2,,Orange,7.0,0.64,dendra2-t69a_orange,pc,dendra2-t69a_green,dendra2-t69a_orange,405,,,,,XKDOQ
m,10.1016/j.jmb.2010.06.056,,,mClavGR2,,MVSKGEETIMSVIKPDMKIKLRMEGNVNGHAFVIEGEGSGKPFEGIQTIDLEVKEGAPLPFAYDILTTAFHYGNRVFTKYPEDIPDYFKQSFPEGYSWERSMTYEDGGICIATNDITMEEDSFINKIHFKGTNFPPNGPVMQKRTVGWEASTEKMYVRDGVLKGDVKMKLLLKGGGHYRCDFRTTYKVKQKAVKLPDYHFVDHRIEILSHDKDYNKVKLYEHAVAHSGLPGMDELYK,mclavgr2,14.63,504,488,19000,,27.0,Green,8.0,0.77,mclavgr2_green,16.96,583,566,32000,,,Red,7.3,0.53,mclavgr2_red,pc,mclavgr2_green,mclavgr2_red,405,,,,,6LRFZ
m,10.1021/jacs.5b09923,,,mEos2-A69T,5DTL,MSAIKPDMKIKLRMEGNVNGHHFVIDGDGTGKPFEGKQSMDLEVKEGGPLPFAFDILTTAFHYGNRVFTKYPDNIQDYFKQSFPKGYSWERSLTFEDGGICIARNDITMEGDTFYNKVRFYGTNFPANGPVMQKKTLKWEPSTEKMYVRDGVLTGDIHMALLLEGNAHYRCDFRTTYKAKEKGVKLPGYHFVDHCIEILSHDKDYNKVKLYEHAVAHSGLPDNARR,meos2-a69t,15.31,509,495,24300,3.4,,Green,8.2,0.63,meos2-a69t_green,7.59,580,565,11500,4.2,,Orange,7.4,0.66,meos2-a69t_orange,pc,meos2-a69t_green,meos2-a69t_orange,405,,,,,YJY7C
m,10.1038/nmeth.2021,,,mEos3.1,,MSAIKPDMKIKLRMEGNVNGHHFVIDGDGTGKPFEGKQSMDLEVKEGGPLPFAFDILTTAFHYGNRVFAKYPDNIQDYFKQSFPKGYSWERSLTFEDGGICNARNDITMEGDTFYNKVRFYGTNFPANGPVMQKKTLKWEPSTEKMYVRDGVLTGDVEMALLLEGNAHYRCDFRTTYKAKEKGVKLPGAHFVDHCIEILSHDKDYNKVKLYEHAVAHSGLPDNARR,meos31,73.37,513,505,88400,,,Green,5.2,0.83,meos31_green,20.77,580,570,33500,,,Red,6.0,0.62,meos31_red,pc,meos31_green,meos31_red,405,,,,,73GT1
m,10.1038/nmeth.2021,,,mEos3.2,,MSAIKPDMKIKLRMEGNVNGHHFVIDGDGTGKPFEGKQSMDLEVKEGGPLPFAFDILTTAFHYGNRVFAKYPDNIQDYFKQSFPKGYSWERSLTFEDGGICNARNDITMEGDTFYNKVRFYGTNFPANGPVMQKKTLKWEPSTEKMYVRDGVLTGDIEMALLLEGNAHYRCDFRTTYKAKEKGVKLPGAHFVDHCIEILSHDKDYNKVKLYEHAVAHSGLPDNARR,meos32,53.26,516,507,63400,,20.0,Green,5.4,0.84,meos32_green,17.71,580,572,32200,,,Red,5.8,0.55,meos32_red,pc,meos32_green,meos32_red,405,,,,,VUXRF
m,10.1038/nmeth.3225,,,mEos4a,,MVSAIKPDMRIKLRMEGNVNGHHFVIDGDGTGKPYEGKQTMDLEVKEGGPLPFAFDILTTAFHYGNRVFVKYPDNIQDYFKQSFPKGYSWERSLTFEDGGICYARNDITMEGDTFYNKVRFYGTNFPANGPVMQKKTLKWEPSTEKMYVRDGVLTGDIHMALLLEGNAHYRCDFRTTYKAKEKGVKLPGYHFVDHAIEILSHDKDYNKVKLYEHAVAHSGLPDNARR,meos4a,71.84,515,505,83530,,,Green,5.25,0.86,meos4a_green,43.31,580,571,61000,,,Red,5.7,0.71,meos4a_red,pc,meos4a_green,meos4a_red,405,,,,,EC56T
m,10.1038/nmeth.3225,,,mEos4b,,MVSAIKPDMRIKLRMEGNVNGHHFVIDGDGTGKPYEGKQTMDLEVKEGGPLPFAFDILTTAFHYGNRVFVKYPDNIQDYFKQSFPKGYSWERSLTFEDGGICNARNDITMEGDTFYNKVRFYGTNFPANGPVMQKKTLKWEPSTEKMYVRDGVLTGDIEMALLLEGNAHYRCDFRTTYKAKEKGVKLPGAHFVDHAIEILSHDKDYNKVKLYEHAVAHSGLPDNARR,meos4b,65.66,516,505,78170,,,Green,5.5,0.84,meos4b_green,39.41,580,570,55500,,,Red,5.8,0.71,meos4b_red,pc,meos4b_green,meos4b_red,405,,,,,V2GB1
m,10.1073/pnas.0403668101,,,mEosFP,3P8U,MSAIKPDMKINLRMEGNVNGHHFVIDGDGTGKPFEGKQSMDLEVKEGGPLPFAFDILTTAFHYGNRVFAEYPDHIQDYFKQSFPKGYSWERSLTFEDGGICIARNDITMEGDTFYNKVRFHGTNFPANGPVMQKKTLKWEPSTEKMYVRDGVLTGDIHMALLLEGNAHYRCDFRTTYKAKEKGVKLPGYHFVDHCIEILSHDKDYNKVKLYEHAVAHSGLPDNARR,meosfp,43.01,516,505,67200,3.5,,Green,5.3,0.64,meosfp_green,22.94,581,569,37000,4.1,,Red,6.5,0.62,meosfp_red,pc,meosfp_green,meosfp_red,400,,,,,N8HMF
m,10.1371/journal.pone.0003944,,,mKikGR,,MSVITSEMKIELRMEGSVNGHKFVITGKGSGRPYEGTQTVDLTVIEGGPLPFAFDILTTAFHYGNRVFVEYPEEIVDYFKQSFPEGYSWERSMSYEDGGICLATNNITMKKDGSNTFVNEIRFDGTNFPANGPVMQRKTVKWEPSTEKMYVRDGVLKGDVEMALLLEGGGHYRCDFRTTYKAKKVVQLPDYHYVDHQMEITSHDKDYNKVKAYEHAKAYSGTYRGAKYEFEA,mkikgr,17.64,591,580,28000,,,Red,5.2,0.63,mkikgr_red,33.81,515,505,49000,,,Green,6.6,0.69,mkikgr_green,pc,mkikgr_green,mkikgr_red,390,,,,,RHTPG
m,10.1371/journal.pone.0051314,ASA47684,152367004,mMaple,,MVSKGEETIMSVIKPDMKIKLRMEGNVNGHAFVIEGEGSGKPFEGIQTIDLEVKEGAPLPFAYDILTTAFHYGNRVFTKYPEDIPDYFKQSFPEGYSWERSMTYEDGGICIATNDITMEEDSFINKIHFKGTNFPPNGPVMQKRTVGWEVSTEKMYVRDGVLKGDVKMKLLLKGGSHYRCDFRTTYKVKQKAVKLPDYHFVDHRIEILSHDKDYNKVKLYEHAVARNSTDSMDELYK,mmaple,11.1,505,489,15000,,,Green,8.2,0.74,mmaple_green,16.8,583,566,30000,,,Red,7.3,0.56,mmaple_red,pc,mmaple_green,mmaple_red,380,,,,,SXSQ9
m,10.1073/pnas.1406593111,,,mMaple3,,MVSKGEETIMSVIKPDMKIKLRMEGNVNGHAFVIEGEGSGKPFEGIQTIDLEVKEGAPLPFAYDILTTAFHYGNRVFTKYPRKIPDYFKQSFPEGYSWERSMTYEDGGICNATNDITMEEDSFINKIHFKGTNFPPNGPVMQKRTVGWEVSTEKMYVRDGVLKGDVKMKLLLKGGSHYRCDFRTTYKVKQKAVKLPKAHFVDHRIEILSHDKDYNKVKLYEHAVARNSTDSMDELYK,mmaple3,5.83,506,491,15760,,,Green,,0.37,mmaple3_green,12.46,583,568,23970,,,Red,,0.52,mmaple3_red,pc,mmaple3_green,mmaple3_red,405,,,,,MNH1D
m,10.1039/c6cc09997a,,,moxDendra2,,MNTPGINLIKEDMRVKVHMEGNVNGHAFVIEGEGKGKPYEGTQTAQLTVKEGAPLPFSYDILTTAVHYGNRVFTKYPEDIPDYFKQSFPEGYSWERTMTFEDKGIATIRSDISLEGDTFFQNVRFKGTNFPPNGPVMQKKTLKWEPSTEKLHVRDGLLVGNINMALLLEGGGHYLADFKTTYKAKKVVQLPDAHFVDHRIEILGQDSDYNKVKLYEHAVARYSPLPSQVW,moxdendra2,17.16,571,551,31200,,,Red,,0.55,moxdendra2_red,25.15,504,490,50300,,,Green,,0.5,moxdendra2_green,pc,moxdendra2_green,moxdendra2_red,405,,,,,Y46HX
m,10.1038/s41598-018-32955-5,,,moxMaple3,,MVSKGEETIMSVIKPDMKIKLRMEGNVNGHAFVIEGEGSGKPFEGIQTIDLEVKEGAPLPFAYDILTTAFHYGNRVFTKYPRKIPDYFKQSFPEGYSWERSMTYEDGGIVQATNDITMEEDSFINKIHFKGTNFPPNGPVMQKRTVGWEVSTEKMYVRDGVLKGDVKMKLLLKGGSHYRADFRTTYKVKQKAVKLPKAHFVDHRIEILSHDKDYNKVKLYEHAVARDSTDSMDELYK,moxmaple3,5.48,506,490,14800,,,Green,,0.37,moxmaple3_green,12.6,584,569,24230,,,Red,,0.52,moxmaple3_red,pc,moxmaple3_green,moxmaple3_red,405,,,,,LY1S9
m,10.1038/nbt1025,AAT01543,,PS-CFP,,MSKGAELFTGIVPILIELNGDVNGHKFSVSGEGEGDATYGKLTLKFICTTGKLPVPWPTLVATLSYGVQCFSRYPDHMKQHDFFKSAMPEGYIQERTIFFEDDGNYKSRAEVKFEGDTLVSRIELTGTDFKEDGNILGNKMEYNYNATNVYIMTDKARNGIKVNFKVRHNIKDGSVQLADHYQQNTPIGDGPVLLPDNHYLSTQSALSKDPNEKRDHMIYLEFVTAAAITHGMDELYKWKLN,ps-cfp,5.44,468,402,34000,,,Cyan,4.0,0.16,ps-cfp_cyan,5.13,511,490,27000,,,Green,6.0,0.19,ps-cfp_green,pc,ps-cfp_cyan,ps-cfp_green,405,,,,,6O8HW
m,,,,PS-CFP2,,MSKGAELFTGIVPILIELNGDVNGHKFSVSGEGEGDATYGKLTLKFICTTGKLPVPWPTLVATLSYGVQCFSRYPDHMKQHDFFKSAMPEGYIQERTIFFEDDGNYKTRAEVKFEGDTLVSRIELTGTDFKEDGNILGNKMEYNYNATNVYIVADKARNGIKVNFKVRHNIKDGSVQLADHYQQNTPIGDGPVLLPDNHYLSTQSALSKDPNEKRDHMIYLEFVTAAAITHGMDELYK,ps-cfp2,8.6,468,400,43000,,,Cyan,,0.2,ps-cfp2_cyan,10.81,511,490,47000,,,Green,,0.23,ps-cfp2_green,pc,ps-cfp2_cyan,ps-cfp2_green,405,,,,,RDRFL
m,10.1038/nmeth.1664,JN376081,,PSmOrange,4Q7T,MVSKGEENNMAIIKEFMRFKVRMEGTVNGHEFEIEGEGEGRPYEGFQTAKLKVTKGGPLPFAWDILSPLFTYGSKAYVKHPADIPDYFKLSFPEGFKWERVMNYEDGGVVTVTQDSSLQDGEFIYKVKMRGTNFPSDGPVMQKKTMGWEASSERMYPEDGALKGEIRMRLKLKDGGHYTSEVKTTYKAKKSVQLPGAYIVGIKLDITSHNEDYTIVEQYERAEGRHSTGGMDELYK,psmorange,9.16,662,634,32700,,,Far-red,5.6,0.28,psmorange_far-red,57.78,565,548,113300,,96.0,Orange,6.2,0.51,psmorange_orange,pc,psmorange_orange,psmorange_far-red,480,,,,,AQ8G3
m,10.1021/ja3034137,AFK91500,,PSmOrange2,4Q7U,MVSKGEENNMAIIKEFMRFKVHMEGTVNGHEFEIEGEGEGHPYEGFQTAKLKVTKGGPLPFAWDILSPLITYGSKAYVKHPADIPDYFKLSFPEGFKWERVMNYEDGGVVTVTQDSSLQDGEFIYKVKMRGTNFPSDGPVMQKKTMGWEASSERMYPEDGALKGEIRMRLKLKDGGHYTSEVKTTYKAKKSVLLPGAYIVGIKLDITSHNEDYTIVEQYERSEARHSTGGMDELYK,psmorange2,31.11,561,546,51000,,210.0,Orange,6.6,0.61,psmorange2_orange,7.18,651,619,18900,,,Far-red,5.4,0.38,psmorange2_far-red,pc,psmorange2_orange,psmorange2_far-red,489,,,,,U76BO
