agg,doi,genbank,ipg_id,name,pdb.0,pdb.1,pdb.2,pdb.3,pdb.4,seq,slug,states.0.brightness,states.0.em_max,states.0.ex_max,states.0.ext_coeff,states.0.lifetime,states.0.maturation,states.0.name,states.0.pka,states.0.qy,states.0.slug,states.1.brightness,states.1.em_max,states.1.ex_max,states.1.ext_coeff,states.1.lifetime,states.1.maturation,states.1.name,states.1.pka,states.1.qy,states.1.slug,states.2.brightness,states.2.em_max,states.2.ex_max,states.2.ext_coeff,states.2.lifetime,states.2.maturation,states.2.name,states.2.pka,states.2.qy,states.2.slug,states.3.brightness,states.3.em_max,states.3.ex_max,states.3.ext_coeff,states.3.lifetime,states.3.maturation,states.3.name,states.3.pka,states.3.qy,states.3.slug,switch_type,transitions.0.from_state,transitions.0.to_state,transitions.0.trans_wave,transitions.1.from_state,transitions.1.to_state,transitions.1.trans_wave,transitions.2.from_state,transitions.2.to_state,transitions.2.trans_wave,transitions.3.from_state,transitions.3.to_state,transitions.3.trans_wave,transitions.4.from_state,transitions.4.to_state,transitions.4.trans_wave,uniprot,uuid
t,10.1371/journal.pone.0002680,AAU06845,3620755,aacuGFP2,,,,,,MSYSKQGIVQEMKTKYRMEGSVNGHEFTIEGVGTGYPYEGKQMSELVIIKPKGKPLPFSFDILSSVFQYGNRCFTKYPADMPDYFKQAFPDGMSYERSFLFEDGAVATASWNIRLEGNCFIHNSIFHGVNFPADGPVMKKKTIGWDKSFEKMTVSKEVLRGDVTMFLMLEGGGYHRCQFHSTYKTEKPVELPPNHVVEHQIVRTDLGQSAKGFTVKLEAHAAAHVNPLKVQ,aacugfp2,66.67,513,502,93900,,,default,,0.71,aacugfp2_default,,,,,,,,,,,,,,,,,,,,,,,,,,,,,,,b,,,,,,,,,,,,,,,,Q66PV9,3W5ZV
t,10.1371/journal.pone.0002680,ACD13192,14926073,aeurGFP,,,,,,MSYSKQGIVQEMKTKYHMEGSVNGHEFTIEGVATGYPYEGKQMSELVIIKPKGKPLPFSFDILSSVFQYGNRCFTKYPADIPDYFKQAFPDGMSYERSFLFEDGAVATASWNIRLEGNCFIHNSIFHGVNFPADGPVMKKQTIGWDKSFEKMTVSKEVLRGDVTMFLMLEGGGYHRCQFHSTYKTEKPVTLPPNHVVEHQIVRTDLGQSAKGFTVKLEALAAAHVNPLKVQ,aeurgfp,97.62,515,504,145700,,,default,,0.67,aeurgfp_default,,,,,,,,,,,,,,,,,,,,,,,,,,,,,,,b,,,,,,,,,,,,,,,,B6CTZ3,4NRYW
t,10.1371/journal.pone.0002680,AAU06857,3620756,afraGFP,,,,,,MSVIVKEMMTKLHMEGTVNGHAFTIEGKGKGDPYNGVQSMNLDVKGGAPLPFSFDLLTPAFMYGNRVFTKYPEDIPDFFKQVFPEGYHWERSITFEDQAVCTATSHIRLDQKEMCFIYDVRFHGVNFPANGPIMQKKILGWEPSTEKMYARDGVLKGDVNMTLRVEGGGHYRADFRTTYKAKKPVNLPGYHFIDHRIEITKHSKDYTNVALYEAAVARHSPLPKVA,afragfp,61.49,503,494,100800,,,default,,0.61,afragfp_default,,,,,,,,,,,,,,,,,,,,,,,,,,,,,,,b,,,,,,,,,,,,,,,,Q66PU5,T5A9C
t,10.1002/jemt.20410,AAU06846,3620747,amilFP513,,,,,,MSYSKQGIVQEMKTKYHMEGSVNGHEFTIEGVGTGYPYEGKQMSELVIIKPAGKPLPFSFDILSSVFQYGNRCFTKYPADMPDYFKQAFPDGMSYERSFLFEDGAVATASWNIRLEGNCFIHKSIFHGVNFPADGPVMKKKTIDWDKSFEKMTVSKEVLRGDVTMFLMLEGGGSHRCQFHSTYKTEKPVTLPPNHVVEHQIVRTDLGQSAKGFTVKLEAHAAAHVNPLKVK,amilfp513,50.38,513,504,75200,,,default,,0.67,amilfp513_default,,,,,,,,,,,,,,,,,,,,,,,,,,,,,,,b,,,,,,,,,,,,,,,,Q66PV8,LO7EL
t,10.1002/jemt.20410,AAU06852,3620742,amilFP593,,,,,,MALSKHGLTKDMTMKYHMEGSVDGHKFVITGHGNGNPFEGKQTMNLCVVEGGPLPFSEDILSAAFDYGNRVFTEYPQGMVDFFKNSCPAGYTWHRSLLFEDGAVCTTSADITVSVEENCFYHNSKFHGVNFPADGPVMKKMTTNWEPSCEKIIPVPRQGILKGDIAMYLLLKDGGRYRCQFDTIYKAKSDPKEMPEWHFIQHKLTREDRSDAKNQKWQLVEHAVASRSALPG,amilfp593,44.54,593,562,90900,,,default,,0.49,amilfp593_default,,,,,,,,,,,,,,,,,,,,,,,,,,,,,,,b,,,,,,,,,,,,,,,,Q66PV2,VDDDT
d,10.1093/molbev/msh079,AAR85350,1978515,anm1GFP1,,,,,,MNVMRYNRGFCRVLQNGVKNLRSRNCSTEEKPVILGAMTETFQKKLPYKLELDGDVDGQTFKVIGEGVGDATTGVIEGKYVCTEGEVPISWVSLITSLSYGAKCFVRYPNEINDFFKSTFPSGYHQERKITYENDGVLETAAKITMESGAIVNRINVKGTGFDKDGHVCQKNLESSPPSTTYVVPEGEGIRIIYRNIYPTKDGHYVVADTQQVNRPIRAQGTSAIPTYHHIKSKVDLSTDPEENKDHIIIKETNCAFDADFS,anm1gfp1,48.75,495,475,75000,,,default,,0.65,anm1gfp1_default,,,,,,,,,,,,,,,,,,,,,,,,,,,,,,,b,,,,,,,,,,,,,,,,Q6RYS6,S1U3D
t,10.1371/journal.pone.0002680,AAU06850,3620748,anobCFP2,,,,,,MSYSKQGIAQVMKTKYHMEGSVNGHEFTIEGVGTGNPYEGTQMSELVITKPAGKPLPFSFDILSTVFQYGNRCFTKYPEGMTDYFKQAFPDGMSYERSFLYEDGGVATAGWNIGLERDCFIHKSIYHGVNFPADGPVMKKKTIGWDKAFEKMTVSKDVLRGDVTGFLMLEGGGYHSCQFHSTYKPEKPAALPPNHVVEHHIVRTDLGQSAKGFTVKLEEHAAAHVNPLKVQ,anobcfp2,32.93,495,477,67200,,,default,,0.49,anobcfp2_default,,,,,,,,,,,,,,,,,,,,,,,,,,,,,,,b,,,,,,,,,,,,,,,,Q66PV4,MHMQX
t,10.1371/journal.pone.0002680,AAU06847,3620741,anobGFP,,,,,,MSYSKQGIAQEMKTKYHMEGSVNGHEFTIEGVGTGYPYEGKQMSELVIIKPAGKPLPFSFDILSSVFQYGNRCFTKYPADMPDYFKQAFPDGMSYERSFLFEDGAVATASWKIRLEGNCFIHNSIFNGVNFPADGPVMEKKTIGWDKSFEKMTVSKEVLRGDVTMFLMLEGGGSHRCQFHSTYKTEKPVTLPPNHVVEHQIVRTDLGQSAKGFTVKLEAHAAAHVNPLKVK,anobgfp,57.72,511,502,96200,,,default,,0.6,anobgfp_default,,,,,,,,,,,,,,,,,,,,,,,,,,,,,,,b,,,,,,,,,,,,,,,,Q66PV7,W1X8H
t,10.1074/jbc.m304063200,BAD52001,3705446,AzamiGreen,,,,,,MSVIKPEMKIKLCMRGTVNGHNFVIEGEGKGNPYEGTQILDLNVTEGAPLPFAYDILTTVFQYGNRAFTKYPADIQDYFKQTFPEGYHWERSMTYEDQGICTATSNISMRGDCFFYDIRFDGVNFPPNGPVMQKKTLKWEPSTEKMYVRDGVLKGDVNMALLLEGGGHYRCDFKTTYKAKKDVRLPDYHFVDHRIEILKHDKDYNKVKLYENAVARYSMLPSQAK,azamigreen,48.44,505,492,72300,,,default,5.0,0.67,azamigreen_default,,,,,,,,,,,,,,,,,,,,,,,,,,,,,,,b,,,,,,,,,,,,,,,,Q60I25,HC91W
d,10.1038/srep05469,,,bfloGFPa1,,,,,,MPLPATHDIHLHGSINGHEFDMVGGGKGDPNAGSLVTTAKSTKGALKFSPYLMIPHLGYGYYQYLPYPDGPSPFQTSMLEGSGYAVYRVFDFEDGGKLTTEFKYSYEGSHIKADMKLMGSGFPDDGPVMTSQIVDQDGCVSKKTYLNNNTIVDSFDWSYNLQNGKRYRARVSSHYIFDKPFSADLMKKQPVFVYRKCHVKASKTEVTLDEREKAFYELA,bflogfpa1,120.9,512,500,120900,,,default,3.0,1.0,bflogfpa1_default,,,,,,,,,,,,,,,,,,,,,,,,,,,,,,,b,,,,,,,,,,,,,,,,,6BXQP
t,10.1007/s10126-007-9072-7,AAZ14788,4535146,ccalGFP1,,,,,,MSLSKQVVKEDMKMTYHMDGCVNGHYFTIEGEGTGKPFKGQKTLKLRVTEGGPLPFAFDILSATFTYGNRCFCDYPEDMPDYFKQSLPEGYSWERTMMYEDGACGTASAHISLDKNGFVHNSTFHGVNFPANGPVMKKKGVNWEPSSEKITACDGILKGDVTMFLVLEGGHRLKCLFQTTYKADKVVKMPPNHIIEHRLVRSEDGDAVQIQEHAVAKYFTV,ccalgfp1,35.88,517,504,78000,,,default,,0.46,ccalgfp1_default,,,,,,,,,,,,,,,,,,,,,,,,,,,,,,,b,,,,,,,,,,,,,,,,Q1ALD4,T41NE
t,10.1007/s10126-007-9072-7,ABI58282,6067037,ccalGFP3,,,,,,MSLSKQVVKQDMNMTYHMDGCVNGHSFTIEGEGRGNPFKGQQTLKLRVTKGGPLPFAFDILSATFTYGNRCFCDYPEDMPDYFKQSLPEGYSWERTMMYEDGGCGTASAHISLNKTGFVHKSTFHGVNFPANGPVMQRKTVNWEPSTEKITACDGTLKGDVTMFLLLGGGYQQKCQFQTTYRTDKTVKMPPNHIIEHRLVRSEDGDAVQIQEHAVAKYFTV,ccalgfp3,69.12,517,505,144000,,,default,,0.48,ccalgfp3_default,,,,,,,,,,,,,,,,,,,,,,,,,,,,,,,b,,,,,,,,,,,,,,,,Q09HR5,UHFSE
t,10.1007/s10126-007-9072-7,AAZ14789,4535492,ccalOFP1,,,,,,MSLSKQVLPRDVKMRFHMDGCVNGHSFTIEGEGTGKPYEGKKTLKLRVTKGGPLPFAFDILSATFTYGNRCFCDYPEEMPDYFKQSLPEGYSWERTMMYEDGACSTASAHISLDKDCFIHNSTFHGVNFPANGPVMQKKAMNWEPSSELITPCDGILKGDVTMFLLQEGGHRHKCQFTTSYKAHKAVKIPPNHIIEHRLVRKEVGDAVQIQEHAVAKHFTVQIKEA,ccalofp1,44.2,561,508,85000,,,default,,0.52,ccalofp1_default,,,,,,,,,,,,,,,,,,,,,,,,,,,,,,,b,,,,,,,,,,,,,,,,Q1ALD3,5YBHO
t,10.1007/s10126-007-9072-7,AAZ67342,4620339,ccalRFP1,,,,,,MSLSKQVLPRDVKMRYHMDGCVNGHQFIIEGEGTGKPYEGKKILELRVTKGGPLPFAFDILSSVFTYGNRCFCEYPEDMPDYFKQSLPEGHSWERTLMFEDGGCGTASAHISLDKNCFVHKSTFHGVNFPANGPVMQKKTLNWEPSSELITAGDGILKGDVTMFLMLEGGHRLKCQFTTSYKAKKAVKMPPNHIIEHRLVRKEVADAVQIQEHAVAKHFIV,ccalrfp1,54.28,598,568,92000,,,default,,0.59,ccalrfp1_default,,,,,,,,,,,,,,,,,,,,,,,,,,,,,,,b,,,,,,,,,,,,,,,,Q2VTM9,T44E8
t,10.1007/s10126-007-9072-7,AAZ67343,4620335,ccalYFP1,,,,,,MSHSKQVITQEMKMVYHMDGCVNGHSFTIEGEGTGKPYEGNQTLKLRVTKGGPLPFAFDILTATFCYGNRCFCEYPEDMPDYYKQSFPEGYSFERTMMFEDGACCTTSVHLSLTKNCFVHNSTFHGVNFPANGPVMQKKTLNWEPSSEKITPFEGNLKGDVTMFLKLEGGQQHRCQFQTTYKAHKAVKMPPNHIIEHRLVRSQDGDAVQLKEHAVAKCFTA,ccalyfp1,106.5,523,514,142000,,,default,,0.75,ccalyfp1_default,,,,,,,,,,,,,,,,,,,,,,,,,,,,,,,b,,,,,,,,,,,,,,,,Q2VTM8,WVV8W
m,10.1371/journal.pone.0037551,,,cfSGFP2,,,,,,MVSKGEELFTGVVPILVELDGDVNGHKFSVSGEGEGDATYGKLTLKFISTTGKLPVPWPTLVTTLTYGVQMFARYPDHMKQHDFFKSAMPEGYVQERTIFFKDDGNYKTRAEVKFEGDTLVNRIELKGIDFKEDGNILGHKLEYNYNSHNVYITADKQKNGIKANFKIRHNIEDGGVQLADHYQQNTPIGDGPVLLPDNHYLSTQSKLSKDPNEKRDHMVLLEFVTAAGITLGMDELYK,cfsgfp2,33.75,517,493,45000,,,default,5.4,0.75,cfsgfp2_default,,,,,,,,,,,,,,,,,,,,,,,,,,,,,,,b,,,,,,,,,,,,,,,,,YAH6C
m,10.1371/journal.pone.0037551,,,cgfTagRFP,,,,,,MSELIKENMHMKLYMEGTVNNHHFKATSEGEGKPYEGTQTMRIKVVEGGPLPFAFDILATSFMYGSRTFINHTQGIPDFFKQSFPEGFTWERVTTYEDGGVLTATQDTSLQDGMLIYNVKIRGVNFPSNGPVMQKKTLGWEANTEMLYPADGGLEGRSDMALKLVGGGHLIVNFKTTYRSKKPAKNLKMPGVYYVDHRLERIKEADKETYVEQHEVAVARYSDLPSKLGHK,cgftagrfp,45.9,585,556,90000,,,default,2.9,0.51,cgftagrfp_default,,,,,,,,,,,,,,,,,,,,,,,,,,,,,,,b,,,,,,,,,,,,,,,,,G9U12
,10.1039/c0pp00023j,ADI71929,20272185,cgreGFP,,,,,,MTTLTEGAKLFEKEIPYITELEGDVEGMKFIIKGVGTGDATTGTIKAKYICTTGDLPVPWATILSSLSYGVFCFAKYPRHIADFFKSTQPDGYSQDRIISFDNDGQYDVKAKVTYENGTLYNRVTVKGTGFKSNGNILGMRVLYHSPPHAVYILPDRKNGGMKIEYNKAFDVMGGGHQMARHAQFNKPLGAWEEDYPLYHHLTVWTSFGKDPDDDETDHLNIVEVIKAVDLETYR,cgregfp,54.21,500,485,63030,,,default,,0.86,cgregfp_default,,,,,,,,,,,,,,,,,,,,,,,,,,,,,,,b,,,,,,,,,,,,,,,,D7PM06,ENFU4
wd,10.1074/jbc.m102815200,,,Citrine,1HUY,3DPW,,,,MVSKGEELFTGVVPILVELDGDVNGHKFSVSGEGEGDATYGKLTLKFICTTGKLPVPWPTLVTTFGYGLMCFARYPDHMKQHDFFKSAMPEGYVQERTIFFKDDGNYKTRAEVKFEGDTLVNRIELKGIDFKEDGNILGHKLEYNYNSHNVYIMADKQKNGIKVNFKIRHNIEDGSVQLADHYQQNTPIGDGPVLLPDNHYLSYQSALSKDPNEKRDHMVLLEFVTAAGITLGMDELYK,citrine,58.52,529,516,77000,3.6,,default,5.7,0.76,citrine_default,,,,,,,,,,,,,,,,,,,,,,,,,,,,,,,b,,,,,,,,,,,,,,,,,VR7EN
d,10.1039/c8ib00063h,,,Citrine2,,,,,,MVSKGEELFTGVVPILVELDGDVNGHKFSVTGEGEGDATYGKLTLKFICTTGKLPVPWPTLVTTFGYGLTCFARYPDHMKQHDFFKSAMPEGYVQERTIFFKDDGNYKTRAEVKFEGDTLVNRIELKGIDFKEDGNILGHKLEYNHNSHYVYIMADKQKNGIKANFKIRHNIEDGSVQLADHYQQNTPIGDGPVLLPDNHYLSYQSQLSKDPNEERDHTVLLEFVTAAGITLGMGELYK,citrine2,68.6,522,509,98000,3.3,,default,5.9,0.7,citrine2_default,,,,,,,,,,,,,,,,,,,,,,,,,,,,,,,b,,,,,,,,,,,,,,,,,ZWH88
wd,10.1038/nmeth.2171,AFR60231,30275454,Clover,5WJ2,,,,,MVSKGEELFTGVVPILVELDGDVNGHKFSVRGEGEGDATNGKLTLKFICTTGKLPVPWPTLVTTFGYGVACFSRYPDHMKQHDFFKSAMPEGYVQERTISFKDDGTYKTRAEVKFEGDTLVNRIELKGIDFKEDGNILGHKLEYNFNSHNVYITADKQKNGIKANFKIRHNVEDGSVQLADHYQQNTPIGDGPVLLPDNHYLSHQSALSKDPNEKRDHMVLLEFVTAAGITHGMDELYK,clover,84.36,515,505,111000,3.2,30.0,default,6.2,0.76,clover_default,,,,,,,,,,,,,,,,,,,,,,,,,,,,,,,b,,,,,,,,,,,,,,,,,4Z641
m,10.1038/nbt.3550,KU530233,,CyOFP1,,,,,,MVSKGEELIKENMRSKLYLEGSVNGHQFKCTHEGEGKPYEGKQTNRIKVVEGGPLPFAFDILATHFMYGSKVFIKYPADLPDYFKQSFPEGFTWERVMVFEDGGVLTATQDTSLQDGELIYNVKVRGVNFPANGPVMQKKTLGWEPSTETMYPADGGLEGRCDKALKLVGGGHLHVNFKTTYKSKKPVKMPGVHYVDRRLERIKEADNETYVEQYEHAVARYSNLGGGMDELYK,cyofp1,30.4,589,497,40000,3.6,15.0,default,5.5,0.76,cyofp1_default,,,,,,,,,,,,,,,,,,,,,,,,,,,,,,,b,,,,,,,,,,,,,,,,,TL112
d,10.1038/nmeth.4046,AOY07766,,CyRFP1,,,,,,MVSKGEELIKENMRSKLYLEGSVNGHQFKCTHEGEGKPYEGKQTNRIKVVEGGPLPFAFDILATMFMYGSKVFIKYPADLPDYFKQSFPEGFTWERVMVFEDGGVLTATQDTSLQDGELIYNVKLRGVNFPANGPVMQKKTLGWEPSTETMYPADGGLEGRCDKALKLVGGGHLHVNFKTTYKSKKPVKMPGVHYVDRRLERIKEADNETYVEQYEHAVARYSNLGGGMDELYK,cyrfp1,36.48,588,529,48000,,12.0,CyRFP1,,0.76,cyrfp1_cyrfp1,,,,,,,,,,,,,,,,,,,,,,,,,,,,,,,,,,,,,,,,,,,,,,,,A8RF9
t,10.1073/pnas.062552299,AAM10625,4560782,dendFP,,,,,,MNLIKEDMRVKVHMEGNVNGHAFVIEGEGKGKPYEGTQTLNLTVKEGAPLPFSYDILTTALHYGNRVFTKYPEDIPDYFKQSFPEGYSWERTMTYEDKGICTIRSDISLEGDCFFQNVRFNGMNFPPNGPVMQKKTLKWEPSTEKLHVRDGLLVGNINMALLLEGGGHYLCDFKTTYKAKKVVQLPDYHFVDHRIEILSNDSDYNKVKLYEHGVARYSPLPSQAW,dendfp,58.5,508,492,90000,,,Green,6.5,0.65,dendfp_green,23.8,575,557,35000,,,Red,5.2,0.68,dendfp_red,,,,,,,,,,,,,,,,,,,,,pc,dendfp_green,dendfp_red,405,,,,,,,,,,,,,Q8T6U0,JTXCJ
m,10.1016/j.chembiol.2011.08.007,,,Dendra2-M159A,,,,,,MNTPGINLIKEDMRVKVHMEGNVNGHAFVIEGEGKGKPYEGTQTANLTVKEGAPLPFSYDILTTAVHYGNRVFTKYPEDIPDYFKQSFPEGYSWERTMTFEDKGICTIRSDISLEGDCFFQNVRFKGTNFPPNGPVMQKKTLKWEPSTEKLHVRDGLLVGNINAALLLEGGGHYLCDFKTTYKAKKVVQLPDAHFVDHRIEILGNDSDYNKVKLYEHAVARYSPLPSQVW,dendra2-m159a,,,,,,,Green (off),,,dendra2-m159a_green-off,,,,,,,Orange (off),,,dendra2-m159a_orange-off,28.11,504,471,51100,2.8,,Green,6.5,0.55,dendra2-m159a_green,33.75,562,528,45000,4.0,,Orange,6.8,0.75,dendra2-m159a_orange,mp,dendra2-m159a_orange-off,dendra2-m159a_orange,440,dendra2-m159a_orange,dendra2-m159a_orange-off,561,dendra2-m159a_green-off,dendra2-m159a_green,405,dendra2-m159a_green,dendra2-m159a_green-off,488,dendra2-m159a_green,dendra2-m159a_orange,405,,CQ4QL
d,10.1073/pnas.082243699,AAM54542,142581,dimer2,,,,,,MVASSEDVIKEFMRFKVRMEGSVNGHEFEIEGEGEGRPYEGTQTAKLKVTKGGPLPFAWDILSPQFQYGSKAYVKHPADIPDYKKLSFPEGFKWERVMNFEDGGVVTVTQDSSLQDGTLIYKVKFRGTNFPPDGPVMQKKTMGWEASTERLYPRDGVLKGEIHQALKLKDGGHYLVEFKTIYMAKKPVQLPGYYYVDTKLDITSHNEDYTIVEQYERSEGRHHLFL,dimer2,47.61,579,552,69000,,120.0,default,4.9,0.69,dimer2_default,,,,,,,,,,,,,,,,,,,,,,,,,,,,,,,b,,,,,,,,,,,,,,,,,DFXUK
d,10.1038/nmeth.2413,,,dLanYFP,,,,,,MVSKGEEDNMASLPATHELHIFGSFNGVDFDMVGRGTGNPNDGYEELNLKSTKGDLQFSPWILVPQIGYGFHQYLPFPDGMSPFQAAMKDGSGYQVHRTMQFEDGASLTSNYRYTYEGSHIKGEFQVKGTGFPADGPVMTNSLTAADWCVTKMLYPNDKTIISTFDWTYTTGNGKRYQSTARTTYTFAKPMAANILKNQPMFVFRKTELKHSKTELNFKEWQKAFTDVMGMDELYK,dlanyfp,112.5,524,513,125000,3.1,,default,3.9,0.9,dlanyfp_default,,,,,,,,,,,,,,,,,,,,,,,,,,,,,,,b,,,,,,,,,,,,,,,,,SKHT2
m,10.1038/nbt.1952,,,Dreiklang,3ST3,3ST2,3ST4,,,MVSKGEELFTGVVPILVELDGDVNGHKFSVSGEGEGDATYGKLTLKFICTTGKLPVPWPTLLTTIGYGLMCFARYPDHMKQHDFFKSAMPEGYVQERTIFFKDDGNYKTRAEVKFEGDTLVNRIELKGIDFKEDGNILGHKLEYNHDSHNVYIMADKQKNGIKVNFKIRHNIEDGSVQLADHYQQNTPIGDGPVLLPDNHYLSYQSALSKDPNEKRDHMVLLEFVTAAGITLGMDELYK,dreiklang,34.03,529,511,83000,,120.0,On,7.2,0.41,dreiklang_on,,,,,,,Off,,,dreiklang_off,,,,,,,,,,,,,,,,,,,,,ps,dreiklang_on,dreiklang_off,405,dreiklang_off,dreiklang_on,365,,,,,,,,,,,JY7XC
m,10.1126/science.1102506,BAD72874,3892390,Dronpa,2IE2,2POX,2IOV,2GX0,,MSVIKPDMKIKLRMEGAVNGHPFAIEGVGLGKPFEGKQSMDLKVKEGGPLPFAYDILTTVFCYGNRVFAKYPENIVDYFKQSFPEGYSWERSMNYEDGGICNATNDITLDGDCYIYEIRFDGVNFPANGPVMQKRTVKWEPSTEKLYVRDGVLKGDVNMALSLEGGGHYRCDFKTTYKAKKVVQLPDYHFVDHHIEIKSHDKDYSNVNLHEHAEAHSELPRQAK,dronpa,,,,,,,Off,,,dronpa_off,80.75,518,503,95000,3.6,40.0,On,,0.85,dronpa_on,,,,,,,,,,,,,,,,,,,,,ps,dronpa_on,dronpa_off,503,dronpa_off,dronpa_on,400,,,,,,,,,,,7P38V
d,10.1042/bj20060874,ABG77396,5860095,dTFP0.2,,,,,,MVSKGEETTMGVIKPDMKIKLKMEGNVNGHAFVIEGEGEGKPYDGTNTVNLEVKEGAPLPFSYDILSNAFQYGNRAFTKYPDDIANYFKQSFPEGYSWERTMTFEDKGIVKVKSDISMEEDSFIYEIRLKGKNFPPNGPVMQKKTLKWEPSTEILYVRDGVLVGDISHSLLLEGGGHYRCDFKTIYKAKKVVKLPDYHFVDHRIEILNHDKDYNKVTLYENAVARYSLLPPQAGMDELYK,dtfp02,40.8,486,456,60000,,,default,,0.68,dtfp02_default,,,,,,,,,,,,,,,,,,,,,,,,,,,,,,,b,,,,,,,,,,,,,,,,,QQJHZ
d,10.1038/nbt1037,AAV52168,3838230,dTomato,,,,,,MVSKGEEVIKEFMRFKVRMEGSMNGHEFEIEGEGEGRPYEGTQTAKLKVTKGGPLPFAWDILSPQFMYGSKAYVKHPADIPDYKKLSFPEGFKWERVMNFEDGGLVTVTQDSSLQDGTLIYKVKMRGTNFPPDGPVMQKKTMGWEASTERLYPRDGVLKGEIHQALKLKDGGHYLVEFKTIYMAKKPVQLPGYYYVDTKLDITSHNEDYTIVEQYERSEGRHHLFLYGMDELYK,dtomato,47.61,581,554,69000,,60.0,default,4.7,0.69,dtomato_default,,,,,,,,,,,,,,,,,,,,,,,,,,,,,,,b,,,,,,,,,,,,,,,,,G1DQY
d,10.1111/j.1742-4658.2010.07618.x,,,dVFP,,,,,,MNVIKPDMRIKLRMEGAVNGHKFVILGDGNGKPYEGTQTIDVTVKEGGPLPFAYDILTSAFQYGNRVFTKYPDDIADYFKQSFPVGYSWERSMTYEDGGICTVSSDIKMEGNSFIYEIRFHGLNFPSDGPVMQKKTVKWEPSTEKMYVRDGVLKGDVNMALLLEGGGHYRCDFKSTYKAKRAVQLPDYHYIDHRIEILSHDKDYNKVKLCENAAARCSMLPSQAK,dvfp,107.0,503,491,107000,,,default,,1.0,dvfp_default,,,,,,,,,,,,,,,,,,,,,,,,,,,,,,,b,,,,,,,,,,,,,,,,,2DB3H
,10.1186/1472-6750-9-32,FJ498892,,E2-Red/Green,,,,,,MDSTENVIKPFMRFKVHMEGSVNGHEFEIEGEGEGKPYEGTHTVKLQVTKGGPLPFAWDILSPQFQYGSKVYVKHPADIPDYKKLSFPEGFKWERVMNFEDGGVVTVTQDSSLQDGTFIYHVKFIGVNFPSDGPVMQKKTLGWEPSTERLYPRDGVLKGEIHKALKLKGGGHYLVEFKSIYMAKKPVKLPGYYYVDSKLDITSHNEDYTVVEQYERTEGRHHLFQ,e2-redgreen,36.05,585,560,53800,,72.0,default,4.5,0.67,e2-redgreen_default,,,,,,,,,,,,,,,,,,,,,,,,,,,,,,,b,,,,,,,,,,,,,,,,,VB2NB
t,10.1371/journal.pone.0002680,ABB17956,4901576,eechGFP1,,,,,,MSVINPDMKIKLYMEGAVNGHKFEIKGEGNGKPFEGKQTMDLAVVDGGPLPFAFDILTTSFNYGNRVFTKYPDTIVDYFKPSFPEGYSWERSMTYEDGGICIATNDITLLKDTDDSNYFYYKIRFDGVNFAANGPVMQKKTAKWEPSTEKMYVRDGVLKGEVNMALLLEGGGHYRCDFKTTYKAKKVVRLPSYHFVDHRIEILSHSKDYNQVRLHEHAEAHSGLPRQAK,eechgfp1,93.15,510,497,124200,,,default,,0.75,eechgfp1_default,,,,,,,,,,,,,,,,,,,,,,,,,,,,,,,b,,,,,,,,,,,,,,,,A8CLQ1,MX4SD
t,10.1371/journal.pone.0002680,ABB17968,4901521,eechGFP2,,,,,,MNVIKPDMKIKLRMEGAVNGHKFAIEGEGNGQPFEGKQTMNLKVKEGGPLPFAYDILTTIFNYGNRVFVKYPDDIVDYFKQSFPEGYSWERSMIYEDGGICIATNDITLEGDCFVYKIRFDGVNFPAKSPVLQKMTKKWEPSTEKLYVRDGVLKGDVNMALLLEGGGHFRCDFKTTYKAKKVVQLPDYHFVDHRIEIMSHDKDYNNVKLCEHAEAHSGLPGQAK,eechgfp2,75.76,520,506,109800,,,default,,0.69,eechgfp2_default,,,,,,,,,,,,,,,,,,,,,,,,,,,,,,,b,,,,,,,,,,,,,,,,A8CLW1,37XMD
t,10.1371/journal.pone.0002680,ABB17969,4901511,eechGFP3,,,,,,MNVIKPDMKIRLRMEGAVNGHKFVIIGKGDGKPYEGTQTMDLEVIEGGPLPFAFDILTTVFKYGNRAFVKYPTDIADYFKQSFPEGFSWERSMTYEDGGICIATNDITLSKDIANCFDYNIRFDGVNFPPNSPVLQKTTIKWEPSTENMYVRDGVLKGDINMSLLLEGGAGHYRCDFKTTYKAKKAVKLPDYHFVDHRITIVSHDKDYNKVKLREHAEAHSGLQMEAK,eechgfp3,54.27,524,512,120600,,,default,,0.45,eechgfp3_default,,,,,,,,,,,,,,,,,,,,,,,,,,,,,,,b,,,,,,,,,,,,,,,,A8CLW4,31NFQ
t,10.1371/journal.pone.0002680,ABB17970,4901480,efasCFP,,,,,,MSFSKQVLNDVTMTYFMEGSVNGHDFTIEGEGTGKPYEGHQRFNLRVTKGAPLPFAVDILSAAFAYGNRCFTKYPKEIPDFFKQSLPEDMSWERTMTFEDGGIVAISAHIRLIGNRFEHKSKFVGVNFPADGPVMQRKTLGWEPSSEKMTPRDGILKGYVPSFLVLQGGGNYRCDYDTSYRAMKPVEMPGGHFIQHRIVRRDIKKDSNGNTWQIQEDAFAHNSEVPDSA,efascfp,31.06,490,466,40333,,,default,,0.77,efascfp_default,,,,,,,,,,,,,,,,,,,,,,,,,,,,,,,b,,,,,,,,,,,,,,,,A8CLW9,OSFMK
t,10.1371/journal.pone.0002680,ABB17958,4901483,efasGFP,,,,,,MALSKQGIQTDMKMTYSMEGCVNGHNFTVKGGGDGNPYEGHQELRLCITMAKGEPVPFAFDILSAAFCYGNRCFTKYPDEIRDYFKQAFPGGLSWERSMAFEDGASAAVTAEISLEGDCFEHECEFVGVNFPANGPVMQKKTQGWETSTEKMTAHGKVVQGNVPMFLKLEGGGRHRCDFRTTYKAKKDVKMPNSHFITHCLVRKGDGNNTELIEDAEARN,efasgfp,100.64,507,496,125800,,,default,,0.8,efasgfp_default,,,,,,,,,,,,,,,,,,,,,,,,,,,,,,,b,,,,,,,,,,,,,,,,A8CLR1,5EU5J
wd,10.1016/0378-1119(95)00685-0,AAB02572,928978,EGFP,2Y0G,4EUL,,,,MVSKGEELFTGVVPILVELDGDVNGHKFSVSGEGEGDATYGKLTLKFICTTGKLPVPWPTLVTTLTYGVQCFSRYPDHMKQHDFFKSAMPEGYVQERTIFFKDDGNYKTRAEVKFEGDTLVNRIELKGIDFKEDGNILGHKLEYNYNSHNVYIMADKQKNGIKVNFKIRHNIEDGSVQLADHYQQNTPIGDGPVLLPDNHYLSTQSALSKDPNEKRDHMVLLEFVTAAGITLGMDELYK,egfp,33.54,507,488,55900,2.6,25.0,default,6.0,0.6,egfp_default,,,,,,,,,,,,,,,,,,,,,,,,,,,,,,,b,,,,,,,,,,,,,,,,C5MKY7,R9NL8
wd,10.1016/s0091-679x(08)61946-9,,,Emerald,,,,,,MVSKGEELFTGVVPILVELDGDVNGHKFSVSGEGEGDATYGKLTLKFICTTGKLPVPWPTLVTTLTYGVQCFARYPDHMKQHDFFKSAMPEGYVQERTIFFKDDGNYKTRAEVKFEGDTLVNRIELKGIDFKEDGNILGHKLEYNYNSHKVYITADKQKNGIKVNFKTRHNIEDGSVQLADHYQQNTPIGDGPVLLPDNHYLSTQSALSKDPNEKRDHMVLLEFVTAAGITLGMDELYK,emerald,39.1,509,487,57500,,11.2,default,,0.68,emerald_default,,,,,,,,,,,,,,,,,,,,,,,,,,,,,,,b,,,,,,,,,,,,,,,,,GLAD6
t,10.1073/pnas.0403668101,AAV54099,3862138,EosFP,,,,,,MSAIKPDMKINLRMEGNVNGHHFVIDGDGTGKPFEGKQSMDLEVKEGGPLPFAFDILTTAFHYGNRVFAEYPDHIQDYFKQSFPKGYSWERSLTFEDGGICIARNDITMEGDTFYNKVRFHGVNFPANGPVMQKKTLKWEPSTEKMYVRDGVLTGDITMALLLEGNAHYRCDFRTTYKAKEKGVKLPGYHFVDHCIEILSHDKDYNKVKLYEHAVAHSGLPDNARR,eosfp,50.4,516,506,72000,,,Green,,0.7,eosfp_green,22.55,581,571,41000,,,Red,,0.55,eosfp_red,,,,,,,,,,,,,,,,,,,,,pc,eosfp_green,eosfp_red,390,,,,,,,,,,,,,Q5S6Z9,16WGJ
d,10.1038/nmeth1062,,,eqFP578,,,,,,MSELIKENMHMKLYMEGTVNNHHFKCTSEGERKPYEGTQTMKIKVVEGGPLPFAFDILATSFMYGSKTFINHTQGIPDLFKQSFPEGFTWERITTYEDGGVLTATQDTSLQNGCIIYNVKINGVNFPSNGSVMQKKTLGWEANTEMLYPADGGLRGHSQMALKLVGGGYLHCSFKTTYRSKKPAKNLKMPGFHFVDHRLERIKEADKETYVEQHEMAVAKYCDLPSKLGHR,eqfp578,55.08,578,552,102000,,,default,,0.54,eqfp578_default,,,,,,,,,,,,,,,,,,,,,,,,,,,,,,,b,,,,,,,,,,,,,,,,H3JQU7,G5OWS
t,10.1073/pnas.182157199,AAN05449,612407,eqFP611,1UIS,,,,,MNSLIKENMRMMVVMEGSVNGYQFKCTGEGDGNPYMGTQTMRIKVVEGGPLPFAFDILATSFMYGSKTFIKHTKGIPDFFKQSFPEGFTWERVTRYEDGGVFTVMQDTSLEDGCLVYHAKVTGVNFPSNGAVMQKKTKGWEPNTEMLYPADGGLRGYSQMALNVDGGGYLSCSFETTYRSKKTVENFKMPGFHFVDHRLERLEESDKEMFVVQHEHAVAKFCDLPSKLGRL,eqfp611,35.1,611,559,78000,2.5,270.0,default,3.84,0.45,eqfp611_default,,,,,,,,,,,,,,,,,,,,,,,,,,,,,,,b,,,,,,,,,,,,,,,,Q8ISF8,R5RQ5
d,10.1117/1.1854680,,,eqFP611 V124T,3E5T,,,,,MNSLIKENMRMMVVMEGSVNGYQFKCTGEGDGNPYMGTQTMRIKVVEGGPLPFAFDILATSFMYGSKTFIKHTKGIPDFFKQSFPEGFTWERVTRYEDGGVFTVMQDTSLEDGCLVYHAKVTGTNFPSNGAVMQKKTKGWEPNTEMLYPADGGLRGYSQMALNVDGGGYLSCSFETTYRSKKTVENFKMPGFHFVDHRLERLEESDKEMFVVQHEHAVAKFCDLPSKLGRL,eqfp611-v124t,31.08,611,559,74000,,450.0,default,,0.42,eqfp611-v124t_default,,,,,,,,,,,,,,,,,,,,,,,,,,,,,,,b,,,,,,,,,,,,,,,,,ALL3F
wd,10.1126/science.273.5280.1392,,,EYFP,,,,,,MVSKGEELFTGVVPILVELDGDVNGHKFSVSGEGEGDATYGKLTLKFICTTGKLPVPWPTLVTTFGYGLQCFARYPDHMKQHDFFKSAMPEGYVQERTIFFKDDGNYKTRAEVKFEGDTLVNRIELKGIDFKEDGNILGHKLEYNYNSHNVYIMADKQKNGIKVNFKIRHNIEDGSVQLADHYQQNTPIGDGPVLLPDNHYLSYQSALSKDPNEKRDHMVLLEFVTAAGITLGMDELYK,eyfp,44.89,527,513,67000,3.1,9.0,default,6.9,0.67,eyfp_default,,,,,,,,,,,,,,,,,,,,,,,,,,,,,,,b,,,,,,,,,,,,,,,,,8DNLG
wd,10.1073/pnas.96.5.2135,,,EYFP-Q69K,,,,,,MVSKGEELFTGVVPILVELDGDVNGHKFSVSGEGEGDATYGKLTLKFICTTGKLPVPWPTLVTTFGYGLKCFARYPDHMKQHDFFKSAMPEGYVQERTIFFKDDGNYKTRAEVKFEGDTLVNRIELKGIDFKEDGNILGHKLEYNYNSHNVYIMADKQKNGIKVNFKIRHNIEDGSVQLADHYQQNTPIGDGPVLLPDNHYLSYQSALSKDPNEKRDHMVLLEFVTAAGITLGMDELYK,eyfp-q69k,54.72,526,514,72000,,,default,5.8,0.76,eyfp-q69k_default,,,,,,,,,,,,,,,,,,,,,,,,,,,,,,,b,,,,,,,,,,,,,,,,,XZJ98
t,10.1371/journal.pone.0002680,ACD13193,14926074,fabdGFP,,,,,,MSVIKPDMKIKLRMEGAVNGHKFAIEGEGKGQPFQGKQTMNLKVKEGGPLPFAYDILTTIFNYGNRVFAKYPDDIVDYFKQSFPEGYSWERSMTYEDGGICIATNDITLDGDCFVYKIRFDGVNFPAKSPVLQKKTQKWEPSTEKLYVRDGLLKGDVNMALLLEGGGHYRCDFKTTYKAKKVVQLPDYHFVDHCIEIVSHDKDYNNVKLCEHAEAHSGLPKEAK,fabdgfp,63.07,520,508,116800,,,default,,0.54,fabdgfp_default,,,,,,,,,,,,,,,,,,,,,,,,,,,,,,,b,,,,,,,,,,,,,,,,B6CTZ4,BQFPM
d,10.1038/10904,,,Folding Reporter GFP,2B3Q,,,,,MSKGEELFTGVVPILVELDGDVNGHKFSVSGEGEGDATYGKLTLKFICTTGKLPVPWPTLVTTLTYGVQCFSRYPDHMKRHDFFKSAMPEGYVQERTISFKDDGNYKTRAEVKFEGDTLVNRIELKGIDFKEDGNILGHKLEYNYNSHNVYITADKQKNGIKANFKIRHNIEDGSVQLADHYQQNTPIGDGPVLLPDNHYLSTQSALSKDPNEKRDHMVLLEFVTAAGITHGMDELYK,folding-reporter-gfp,59.33,530,490,82400,,,default,,0.72,folding-reporter-gfp_default,,,,,,,,,,,,,,,,,,,,,,,,,,,,,,,b,,,,,,,,,,,,,,,,,N6ZHS
m,10.1186/1741-7007-6-13,,,G3,,,,,,MVSKGEETTMGVIKPDMKIKLKMEGNVNGHAFVIEGEGEGKPYDGTNTINLEVKEGAPLPFSYDILTTAFAYGNRAFAKYPDDIPNYFKQSFPEGYSWERTMTFEDKGIVKVKSDISMEEDSFIYEIHLKGENFPPNGPVMQKMTTGWDASTERMYVRDGVLKGDVKMKLLLEGGGHHRVDFKTIYRAKKAVKLPDYHFVDHRIEILNHDKDYNKVTVYESAVARNSTDGMDELYK,g3,34.3,515,498,49000,,,default,,0.7,g3_default,,,,,,,,,,,,,,,,,,,,,,,,,,,,,,,b,,,,,,,,,,,,,,,,,FM76L
m,10.1016/j.chembiol.2017.12.005,BBC28144,174808012,Gamillus,5Y01,5Y00,,,,MVSKGEEASGRALFQYPMTSKIELNGEINGKKFKVAGEGFTPSSGRFNMHAYCTTGDLPMSWVVIASPLQYGFHMFAHYPEDITHFFQECFPGSYTLDRTLRMEGDGTLTTHHEYSLEDGCVTSKTTLNASGFDPKGATMTKSFVKQLPNEVKITPHGPNGIRLTSTVLYLKEDGTIQIGTQDCIVTPVGGRKVTQPKAHFLHTQIIQKKDPNDTRDHIVQTELAVAGNLWHGMDELYK,gamillus,74.7,519,504,83000,,8.0,On,3.4,0.9,gamillus_on,,,,,,,Off,,,gamillus_off,,,,,,,,,,,,,,,,,,,,,ps,gamillus_on,gamillus_off,488,gamillus_off,gamillus_on,388,,,,,,,,,,,21PQ5
d,10.1016/j.chembiol.2017.12.005,,,Gamillus0.2,,,,,,MASGRALFQYPMTSKIELNGEINGKKFKVAGEGFTPNSGRFNMHAYCTTGDLPMSWVVIASPLQYGFHMFAHYPEDITHFFQECFPGSYTLDRTLRMEGDGTLTTHHEYSLKDGCVTSKTTLNASGFDPKGATMTKSFVEQLPNQVEITAEGNGIRLTSTVLYLKKDGTIQIGRQDCIVKPVGGKKVTQPKAHFLHTQIIQKKDPNDTRDHIVQTELAVAGNPWHEPSASAV,gamillus02,51.7,524,505,55000,,,default,4.0,0.94,gamillus02_default,,,,,,,,,,,,,,,,,,,,,,,,,,,,,,,b,,,,,,,,,,,,,,,,,WLNHW
m,10.1016/j.chembiol.2017.12.005,,,Gamillus0.3,,,,,,MASGRALFQYPMTSKIELNGEINGKKFKVAGEGFTPNSGRFNMHAYCTTGDLPMSWVVIASPLQYGFHMFAHYPEDITHFFQECFPGSYTLDRTLRMEGDGTLTTHHEYSLKDGCVTSKTTLNASGFDPKGATMTKSFVEQLPNQVEITAEGNGIRLTSTVLYLKKDGTIQIGTQDCIVKPVGGKKVTQPKAHFLHTQIIQKKDPNDTRDHIVQTELAVAGNPWHEPSASAV,gamillus03,44.88,524,505,51000,,,default,4.0,0.88,gamillus03_default,,,,,,,,,,,,,,,,,,,,,,,,,,,,,,,b,,,,,,,,,,,,,,,,,LQXJ6
m,10.1016/j.chembiol.2017.12.005,,,Gamillus0.4,,,,,,MASGRALFQYPMTSKIELNGEINGKKFKVAGEGFTPSSGRFNMHAYCTTGDLPMSWVVIASPLQYGFHMFAHYPEDITHFFQECFPGSYTLDRTLRMEGDGTLTTHHEYSLEDGCVTSKTTLNASGFDPKGATMTKSFVEQLPNQVKITAEGNGIRLTSTVLYLKKDGTIQIGTQDCIVKPVGGRKVTQPKAHFLHTQIIQKKDPNDTRDHIVQTELAVAGNLWHEPSASAV,gamillus04,66.75,524,505,75000,,,default,4.0,0.89,gamillus04_default,,,,,,,,,,,,,,,,,,,,,,,,,,,,,,,b,,,,,,,,,,,,,,,,,JVUSZ
t,10.1371/journal.pone.0002680,ABB17962,4901546,gfasGFP,,,,,,MNVIKPDMKIKLCMRGTINGHNFVIEGEGKGNPYEGTQILDLNVTEGAPLPFAYDILTTVFQYGNRAFTKYPADIQDYFKQTFPEGYHWERSMTYEDQGICTATSNISMRGDCFFYDIRFDGVNFPPNGPVMQKKTLKWEPSTEKMYVRDGVLKGDVNMALLLEGGGHYRCDFKTTYKAKKDVRLPDYHFVDHRIEILKHDKDYNKVELYENAVARYSMLPSQAK,gfasgfp,74.83,506,492,102500,,,default,,0.73,gfasgfp_default,,,,,,,,,,,,,,,,,,,,,,,,,,,,,,,b,,,,,,,,,,,,,,,,A8CLT2,ASMG7