agg,doi,genbank,ipg_id,name,pdb.0,pdb.1,pdb.2,pdb.3,seq,slug,states.0.brightness,states.0.em_max,states.0.ex_max,states.0.ext_coeff,states.0.lifetime,states.0.maturation,states.0.name,states.0.pka,states.0.qy,states.0.slug,states.1.brightness,states.1.em_max,states.1.ex_max,states.1.ext_coeff,states.1.lifetime,states.1.maturation,states.1.name,states.1.pka,states.1.qy,states.1.slug,states.2.brightness,states.2.em_max,states.2.ex_max,states.2.ext_coeff,states.2.lifetime,states.2.maturation,states.2.name,states.2.pka,states.2.qy,states.2.slug,states.3.brightness,states.3.em_max,states.3.ex_max,states.3.ext_coeff,states.3.lifetime,states.3.maturation,states.3.name,states.3.pka,states.3.qy,states.3.slug,states.4.brightness,states.4.em_max,states.4.ex_max,states.4.ext_coeff,states.4.lifetime,states.4.maturation,states.4.name,states.4.pka,states.4.qy,states.4.slug,switch_type,uniprot,uuid
m,10.1101/2020.03.30.015156,LC085679,,AzaleaB5,,,,,MENVRRKTGIQTEMKTKLHMDGMVNGHSFEIKGEGKGSPYEGVQTMKLKVTKGAPLPFSIDILLPQCMYGSKPFIKYPENIPDYLKLSFPEGITWERTMTFEDGAVCDVSNDSRLVGNCFIYTVKFQGVNFPLDGPVMQKKTRGWEPSTEVLYECDGWMRGLVDIALKLENGGHYMCNFKTTYKSKKGLEVPPYHFVDHKLDLLSHNTDGATFEEFEQGEIAHAHLSKLA,azaleab5,60.32,596,574,104000,,,default,,0.58,azaleab5_default,,,,,,,,,,,,,,,,,,,,,,,,,,,,,,,,,,,,,,,,,b,,886AH
wd,10.1016/0378-1119(95)00685-0,AAB02572,928978,EGFP,2Y0G,4EUL,,,MVSKGEELFTGVVPILVELDGDVNGHKFSVSGEGEGDATYGKLTLKFICTTGKLPVPWPTLVTTLTYGVQCFSRYPDHMKQHDFFKSAMPEGYVQERTIFFKDDGNYKTRAEVKFEGDTLVNRIELKGIDFKEDGNILGHKLEYNYNSHNVYIMADKQKNGIKVNFKIRHNIEDGSVQLADHYQQNTPIGDGPVLLPDNHYLSTQSALSKDPNEKRDHMVLLEFVTAAGITLGMDELYK,egfp,33.54,507,488,55900,2.6,25.0,default,6.0,0.6,egfp_default,,,,,,,,,,,,,,,,,,,,,,,,,,,,,,,,,,,,,,,,,b,C5MKY7,R9NL8
m,10.1038/nbt1037,AAV52164,3838123,mCherry,2H5Q,,,,MVSKGEEDNMAIIKEFMRFKVHMEGSVNGHEFEIEGEGEGRPYEGTQTAKLKVTKGGPLPFAWDILSPQFMYGSKAYVKHPADIPDYLKLSFPEGFKWERVMNFEDGGVVTVTQDSSLQDGEFIYKVKLRGTNFPSDGPVMQKKTMGWEASSERMYPEDGALKGEIKQRLKLKDGGHYDAEVKTTYKAKKPVQLPGAYNVNIKLDITSHNEDYTIVEQYERAEGRHSTGGMDELYK,mcherry,15.84,610,587,72000,1.4,15.0,default,4.5,0.22,mcherry_default,,,,,,,,,,,,,,,,,,,,,,,,,,,,,,,,,,,,,,,,,b,X5DSL3,ZERB6
m,10.1039/c6cc09081h,,,mGarnet2,,,,,MNSLIKENMRMKVVLEGSVNGHQFKCTGEGEGNPYMGTQTMRIKVIEGGPLPFAFDILATSFMYGSKTFIKYPKGIPDFFKQSFPEGFTWERVTRYEDGGVITVMQDTSLEDGCLVYHAQLRGVNFPSNGAVMQKKTKGWEPNTEMMYPADGGLRGYNHMALKVDGGGHLHCSLVTTYRSKKTVGNIKMPGIHAVDRRLERLEESDNEMFVVQREHAVAKFAGLGGG,mgarnet2,9.13,671,598,105000,0.76,,default,6.8,0.087,mgarnet2_default,,,,,,,,,,,,,,,,,,,,,,,,,,,,,,,,,,,,,,,,,b,,7DP3C
m,10.1038/nbt1207,BAE93226,5593672,mKeima,2WHS,2WHU,2WHT,3IR8,MVSVIAKQMTYKVYMSGTVNGHYFEVEGDGKGKPYEGEQTVKLTVTKGGPLPFAWDILSPQLQYGSIPFTKYPEDIPDYFKQSFPEGYTWERSMNFEDGAVCTVSNDSSIQGNCFIYNVKISGENFPPNGPVMQKKTQGWEPSTERLFARDGMLIGNDYMALKLEGGGHYLCEFKSTYKAKKPVRMPGRHEIDRKLDVTSHNRDYTSVEQCEIAIARHSLLG,mkeima,,620,586,,,,pH5,6.5,,mkeima_ph5,,620,440,,,,pH6,6.5,,mkeima_ph6,,620,440,,,,pH8,6.5,,mkeima_ph8,,620,586,,,,pH4,6.5,,mkeima_ph4,3.46,620,440,14400,2.93,180.0,pH7.4,6.5,0.24,mkeima_ph74,b,Q1JV70,SXBT1
m,10.1073/pnas.082243699,CAH64892,570910,mRFP1,,,,,MASSEDVIKEFMRFKVRMEGSVNGHEFEIEGEGEGRPYEGTQTAKLKVTKGGPLPFAWDILSPQFQYGSKAYVKHPADIPDYLKLSFPEGFKWERVMNFEDGGVVTVTQDSSLQDGEFIYKVKLRGTNFPSDGPVMQKKTMGWEASTERMYPEDGALKGEIKMRLKLKDGGHYDAEVKTTYMAKKPVQLPGAYKTDIKLDITSHNEDYTIVEQYERAEGRHSTGA,mrfp1,12.5,607,584,50000,,60.0,default,4.5,0.25,mrfp1_default,,,,,,,,,,,,,,,,,,,,,,,,,,,,,,,,,,,,,,,,,b,,5YCFA
m,10.1038/nmeth.4074,APD76535,129830964,mScarlet,5LK4,,,,MVSKGEAVIKEFMRFKVHMEGSMNGHEFEIEGEGEGRPYEGTQTAKLKVTKGGPLPFSWDILSPQFMYGSRAFTKHPADIPDYYKQSFPEGFKWERVMNFEDGGAVTVTQDTSLEDGTLIYKVKLRGTNFPPDGPVMQKKTMGWEASTERLYPEDGVLKGDIKMALRLKDGGRYLADFKTTYKAKKPVQMPGAYNVDRKLDITSHNEDYTVVEQYERSEGRHSTGGMDELYK,mscarlet,70.0,594,569,100000,3.9,174.0,default,5.3,0.7,mscarlet_default,,,,,,,,,,,,,,,,,,,,,,,,,,,,,,,,,,,,,,,,,b,,FVS3D
m,10.1186/1741-7007-6-13,ABW74902.1,,mWasabi,,,,,MVSKGEETTMGVIKPDMKIKLKMEGNVNGHAFVIEGEGEGKPYDGTNTINLEVKEGAPLPFSYDILTTAFSYGNRAFTKYPDDIPNYFKQSFPEGYSWERTMTFEDKGIVKVKSDISMEEDSFIYEIHLKGENFPPNGPVMQKETTGWDASTERMYVRDGVLKGDVKMKLLLEGGGHHRVDFKTIYRAKKAVKLPDYHFVDHRIEILNHDKDYNKVTVYEIAVARNSTDGMDELYK,mwasabi,56.0,509,493,70000,,,default,6.5,0.8,mwasabi_default,,,,,,,,,,,,,,,,,,,,,,,,,,,,,,,,,,,,,,,,,b,,QTBVW
,10.1038/28190,AAC40226,,"pHluorin, ecliptic",,,,,MSKGEELFTGVVPILVELDGDVNGHKFSVSGEGEGDATYGKLTLKFICTTGKLPVPWPTLVTTFSYGVQCFSRYPDHMKRHDFFKSAMPEGYVQERTIFFKDDGNYKTRAEVKFEGDTLVNRIELKGIDFKEDGNILGHKLEYNYNDHQVYIMADKQKNGIKANFKIRHNIEDGGVQLADHYQQNTPIGDGPVLLPDNHYLFTTSTLSKDPNEKRDHMVLLEFVTAAGITHGMDELYK,phluorin-ecliptic,,509,395,,,,acidic,,,phluorin-ecliptic_acidic,,509,395,,,,default,7.1,,phluorin-ecliptic_default,,,,,,,,,,,,,,,,,,,,,,,,,,,,,,,o,,KPFB9
,10.1074/jbc.m312846200,,,roGFP2,1JC1,,,,MSKGEELFTGVVPILVELDGDVNGHKFSVSGEGEGDATYGKLTLKFISTTGKLPVPWPTLVTTLTYGVQCFSRYPDHMKRHDFFKSAMPEGYVQERTIFFKDDGNYKTRAEVKFEGDTLVNRIELKGIDFKEDGNILGHKLEYNYNCHNVYIMADKQKNGIKVNFKIRHNIEDGSVQLADHYQQNTPIGDGPVLLPDNHYLSTCSALSKDPNEKRDHMVLLEFVTAAGITHGMDELYK,rogfp2,,511,490,,,,default,,,rogfp2_default,,,,,,,,,,,,,,,,,,,,,,,,,,,,,,,,,,,,,,,,,b,,KTFOJ
