agg,doi,genbank,ipg_id,name,pdb.0,pdb.1,pdb.2,seq,slug,states.0.brightness,states.0.em_max,states.0.ex_max,states.0.ext_coeff,states.0.lifetime,states.0.maturation,states.0.name,states.0.pka,states.0.qy,states.0.slug,switch_type,uniprot,uuid
,10.1083/jcb.202209077,,,Alexa Fluor Plus 800,,,,,alexa-fluor-plus-800,,794,789,,,,Alexa Fluor Plus 800,,,alexa-fluor-plus-800_alexa-fluor-plus-800,b,,L76OZ
t,10.1073/pnas.2307687120,,,AzamiRed1.0,8I4K,,,MVSVIKEEMKIKLRMEGTVNGHNFVIEGEGKGNPYEGTQTMDLKVTEGGPLPFAYDILSPQFMYGSKAFIKYPADIPDYFKQSFPEGFHWERVMTYEDGGVCTATQNTSLRGDCFFYDVRFDGVNFPPNGPVMQKKTLGWEPSTEKMYVRDGVLKGDVIKALLLEGGGHYRCDFKTTYKAKKDVRLPGYHFVDHRIEILKHDKDYNKVKQYENAVARYSMLPSQAK,azamired10,22.16,606,571,34100,,,default,,0.65,azamired10_default,b,,1NUNN
,10.1021/acssensors.3c00484,,,Lime,,,,MVSKGEELFTGVVPILVELDGDVNGHKFSVRGEGEGDATNGKLTLKFISTTGKLPVPWPTLVTTLTYGVQSFSRYPDHMKRHDFFKSAMPEGYVQERTISFKDDGTYKTRAEVKFEGDTLVNRIELKGIDFKEDGNILGHKLEYNFNDHQVYITADKQKNGIKANFKIRHNVEDGSVQLADHYQQNTPIGDGPVLLPDNHYLFTTSTLSKDPNEKRDHMVLLEFVTAAGITHGMDELYK,lime,34.65,510,488,45000,,,default,7.1,0.77,lime_default,o,,BJRSJ
m,10.1101/2023.07.16.549156,,,LSSmApple,,,,MVSKGEENNMAIIKEFMRFKVHMEGSVNGHEFEIEGEGEGRPYEAFQTAKLKVTKGGPLPFTWDILSPQFMYGSKVYIKHPADIPDYFKLSFPEGFRWERVMIFEDGGIIHVNQDSSLQDGVFIYKVKLRGTNFPSDGPVMQKKTMGLEACEERMYPEDGALKSEYKEWLKLKDGGHYAAEVKTTYKAKKPVQLPGAYIVDIKLDIVSHNEDYTIVEQYERAEGRHSTGGMDELYK,lssmapple,13.95,600,490,45000,,110.0,default,4.3,0.31,lssmapple_default,b,,JMXXU
m,10.1073/pnas.2307687120,,,mARs1,,,,MVSVIKEEMKIRLRMEGTVNGHNFVIEGEGKGNPYEGTQTLDCKVTEGGPLPFAYDILSPQFMYGSKPFIKYPADIPDYFKQSYPEGQHWERVMTYEDGGVCTATQNSSLRGDCFFYDVRFDGTNFPPNGPVMQKKTLGWVPSSEKMYVRDGVLKGDVSKALLLEGGGHYRCDFKTTYKAKKDVRLPGAHKVDHRIEILKHDKDYNNVKLYEIAVARYS,mars1,7.05,598,571,27100,,,default,,0.26,mars1_default,b,,A6URG
m,10.1038/s41592-024-02203-y,,,mBaoJin,8QBJ,8Q79,8QDD,MVSKGEEENMASTPFKFQLKGTINGKSFTVEGEGEGNSHEGSHKGKYVCTSGKLPMSWAALGTTFGYGMKYYTKYPSGLKNWFREVMPGGFTYDRHIQYKGDGSIHAKHQHFMKNGTYHNIVEFTGQDFKENSPVLTGDMNVSLPNEVPQIPRDDGVECPVTLLYPLLSDKSKYVEAHQYTICKPLHNQPAPDVPYHWIRKQYTQSKDDAEERDHICQSETLEAHLKGMDELYK,mbaojin,119.04,508,500,128000,3.1,7.6,default,4.37,0.93,mbaojin_default,b,,4XHVQ
m,10.21203/rs.3.rs-3188559/v1,,,mBaoJin-N137K,,,,,mbaojin-n137k,49.61,510,504,72949,,,default,,0.68,mbaojin-n137k_default,b,,VBNF5
m,10.21203/rs.3.rs-3188559/v1,,,mBaoJin-S134P,,,,,mbaojin-s134p,58.3,510,502,70245,,,default,,0.83,mbaojin-s134p_default,b,,YM2UC
m,10.21203/rs.3.rs-3188559/v1,,,mBaoJin-T55S,,,,MVSKGEEENMASTPFKFQLKGTINGKSFTVEGEGEGNSHEGSHKGKYVCTSGKLPMSWAALGTSFGYGMKYYTKYPSGLKNWFREVMPGGFTYDRHIQYKGDGSIHAKHQHFMKNGTYHNIVEFTGQDFKENSPVLTGDMNVSLPNEVPQIPRDDGVECPVTLLYPLLSDKSKYVEAHQYTICKPLHNQPAPDVPYHWIRKQYTQSKDDAEERDHICQSETLEAHLKGMDELYK,mbaojin-t55s,109.22,508,497,127000,,,default,,0.86,mbaojin-t55s_default,b,,KEBCT
m,10.21203/rs.3.rs-3188559/v1,,,mBaoJin-V152E,,,,,mbaojin-v152e,69.63,508,498,114146,,,default,,0.61,mbaojin-v152e_default,b,,K655P
m,10.1038/s41592-023-01809-y,,,mScarlet-220A,,,,MVSKGEAVIKEFMRFKVHMEGSMNGHEFEIEGEGEGRPYEGTQTAKLKVTKGGPLPFSWDILSPQFMYGSRAFTKHPADIPDYYKQSFPEGFKWERVMNFEDGGAVTVTQDTSLEDGTLIYKVKLRGTNFPPDGPVMQKKTMGWEASTERLYPEDGVLKGDIKMALRLKDGGRYLADFKTTYKAKKPVQMPGAYNVDRKLDITSHNEDYTVVEQYERSEARHSTGGMDELYK,mscarlet-220a,63.46,594,568,95000,,,default,,0.668,mscarlet-220a_default,b,,ZHYAA
m,10.1038/s41592-023-01809-y,,,mScarlet-2A,,,,MVSKGEAVIKEFMRFKVHMEGSMNGHEFEIEGEGEGRPYEGTQTAKLKVTKGGPLPFSWDILSPQFMYGSRAFTKHPADIPDYYKQSFPEGFKWERVMNFEDGGAVSVTQDTSLEDGTLIYKVKLRGTNFPPDGPVMQKKTMGWEASTERLYPEDVVLKGDIKMALRLKDGGRYLADFKTTYKAKKPVQMPGAYNIDRKLDITSHNEDYTVVEQYERSVARHSTGGMDELYK,mscarlet-2a,66.44,592,568,97000,,,default,,0.685,mscarlet-2a_default,b,,2G7N6
m,10.1038/s41592-023-01809-y,,,mScarlet-2A-84W,,,,MVSKGEAVIKEFMRFKVHMEGSMNGHEFEIEGEGEGRPYEGTQTAKLKVTKGGPLPFSWDILSPQFMYGSRAFTKHPADIPDYWKQSFPEGFKWERVMNFEDGGAVSVTQDTSLEDGTLIYKVKLRGTNFPPDGPVMQKKTMGWEASTERLYPEDVVLKGDIKMALRLKDGGRYLADFKTTYKAKKPVQMPGAYNIDRKLDITSHNEDYTVVEQYERSVARHSTGGMDELYK,mscarlet-2a-84w,67.9,592,568,97000,,,default,,0.7,mscarlet-2a-84w_default,b,,5CEBO
m,10.1038/s41592-023-01809-y,,,mScarlet3,7ZCT,,,MDSTEAVIKEFMRFKVHMEGSMNGHEFEIEGEGEGRPYEGTQTAKLRVTKGGPLPFSWDILSPQFMYGSRAFTKHPADIPDYWKQSFPEGFKWERVMNFEDGGAVSVAQDTSLEDGTLIYKVKLRGTNFPPDGPVMQKKTMGWEASTERLYPEDVVLKGDIKMALRLKDGGRYLADFKTTYRAKKPVQMPGAFNIDRKLDITSHNEDYTVVEQYERSVARHSTGGSGGS,mscarlet3,78.0,592,569,104000,4.0,37.0,default,4.5,0.75,mscarlet3_default,b,,1AFJZ
m,10.1038/s41592-023-01809-y,,,mScarlet-I-220A,,,,MVSKGEAVIKEFMRFKVHMEGSMNGHEFEIEGEGEGRPYEGTQTAKLKVTKGGPLPFSWDILSPQFMYGSRAFIKHPADIPDYYKQSFPEGFKWERVMNFEDGGAVTVTQDTSLEDGTLIYKVKLRGTNFPPDGPVMQKKTMGWEASTERLYPEDGVLKGDIKMALRLKDGGRYLADFKTTYKAKKPVQMPGAYNVDRKLDITSHNEDYTVVEQYERSEARHSTGGMDELYK,mscarlet-i-220a,54.3,594,568,100000,,,default,,0.543,mscarlet-i-220a_default,b,,3DUUH
m,10.1038/s41592-023-01809-y,,,mScarlet-I3,,,,MDSTEAVIKEFMRFKVHMEGSMNGHEFEIEGEGEGRPYEGTQTAKLKVTKGGPLPFSWDILSPQFMYGSRAFIKHPADIPDYWKQSFPEGFKWERVMIFEDGGTVSVTQDTSLEDGTLIYKVKLRGGNFPPDGPVMQKRTMGWEASTERLYPEDVVLKGDIKMALRLKDGGRYLADFKTTYKAKKPVQMPGAFNIDRKLDITSHNEDYTVVEQYERSVARHSTGGSGGS,mscarlet-i3,68.25,592,568,105000,3.6,2.0,default,4.2,0.65,mscarlet-i3_default,b,,THSBS
m,10.1038/s41592-023-01809-y,,,mScarlet-I3-NCwt,,,,MVSKGEAVIKEFMRFKVHMEGSMNGHEFEIEGEGEGRPYEGTQTAKLKVTKGGPLPFSWDILSPQFMYGSRAFIKHPADIPDYWKQSFPEGFKWERVMIFEDGGTVSVTQDTSLEDGTLIYKVKLRGGNFPPDGPVMQKRTMGWEASTERLYPEDVVLKGDIKMALRLKDGGRYLADFKTTYKAKKPVQMPGAFNIDRKLDITSHNEDYTVVEQYERSVARHSTGGMDELYK,mscarlet-i3-ncwt,66.61,592,567,102000,,,default,,0.653,mscarlet-i3-ncwt_default,b,,1VSM7
m,10.1038/s41592-023-02085-6,LC756333,,mStayGold,,,,MVSTGEELFTGVVPFKFQLKGTINGKSFTVEGEGEGNSHEGSHKGKYVCTSGKLPMSWAALGTSFGYGMKYYTKYPSGLKNWFHEVMPEGFTYDRHIQYKGDGSIHAKHQHFMKNGTYHNIVEFTGQDFKENSPVLTGDMDVSLPNEVQHIPIDDGVECTVTLQYPLLSDESKCVEAYQNTIIKPLHNQPAPDVPFHWIRKQYTQSKDDTEERDHIIQSETLEAHL,mstaygold,136.12,510,499,164000,2.79,,default,4.8,0.83,mstaygold_default,b,,5H7QY
m,10.1038/s41592-023-02085-6,LC756334,,mStayGold2,,,,MVSTGEELFTGVVPFKFQLKGTINGKSFTVEGEGEGNSHEGSHKGKYVCTSGKLPMSWAALGTSFGYGMKYYTKYPSGLKNWFHEVMPEGFTYDRHIQYKGDGSIHAKHQHFMKNGTYHNIVEFTGQDFKENSPVLTGDMDVSLPNEVQHIPRDDGVECTVTLTYPLLSDESKCVEAYQNTIIKPLHNQPAPDVPYHWIRKQYTQSKDDTEERDHIIQSETLEAHLYSRTKLE,mstaygold2,138.25,509,499,175000,2.83,,default,4.8,0.79,mstaygold2_default,b,,95LHQ
m,10.1038/s41592-023-02085-6,,,QC2-6,,,,MVSTGEELFTGVVPFKFQLKGTINGKSFTVEGEGEGNSHEGSHKGKYVCTSGKLPMSWAALGTSFGYGMKYYTKYPSGLKNWFHEVMPEGFTYDRHIQYKGDGSIHAKHQHFMKNGTYHNIVEFTGQDFKENSPVLTGDMDVSLPNEVQHIPRDDGVECTVTLTYPLLSDESKCVEAYQNTIIKPLHNQPAPDVPYHWIRKQYTQSKDDTEERDHIIQSETLEAHL,qc2-6,,504,496,,,,default,,,qc2-6_default,b,,L3PJW
d,10.1002/bit.28393,,,sfOrange,,,,MVSKGEENNMAIIKEFMRFKVRMEGSVNGHEFEIEGEGEGHPYEGFQTARLKVTKGDPLPFAWDILSPQFTYGSKAYVKHPADIPDYFKLSFPEGFTWERVMNFEDGGVVAVTQDSSLQDGQFIYKVKLLGINFPSDGPVMQKKTMGWEASTERMYPEDGALKGEIKMRLKLKDGGHYTSEVKTTYRAKKPVQLPGAYDVDIKLDITSHNEDYTIVEQYERAEARHSTGGMDELYK,sforange,,560,546,,,,default,,,sforange_default,b,,UPDD1
m,10.1038/s41587-023-02018-w,,,StayGold-E138D,,,,MASTPFKFQLKGTINGKSFTVEGEGEGNSHEGSHKGKYVCTSGKLPMSWAALGTSFGYGMKYYTKYPSGLKNWFHEVMPEGFTYDRHIQYKGDGSIHAKHQHFMKNGTYHNIVEFTGQDFKENSPVLTGDMNVSLPNDVQHIPRDDGVECPVTLLYPLLSDKSKCVEAHQNTICKPLHNQPAPDVPYHWIRKQYTQSKDDTEERDHICQSETLEAHL,staygold-e138d,126.15,504,497,145000,,14.0,default,4.6,0.87,staygold-e138d_default,b,,Q8WTP
td,10.1038/s41592-023-02085-6,LC756336,,td5oxStayGold,,,,MVSTGEELFTGVVPFKFQLKGTINGKSFTVEGEGEGNSHEGSHKGKYVCTSGKLPMSWAALGTSFGYGMKYYTKYPSGLKNWFHEVMPEGFTYDRHIQYKGDGSIHAKHQHFMKNGTYHNIVEFTGQDFKENSPVLTGDMNVSLPNEVQHIPRDDGVECPVTLLYPLLSDKSKCVEAYQNTIIKPLHNQPAPDVPYHWIRKQYTQSKDDTEERDHIIQSETLEAHLPWHEPSASAVGHGTGSTGSGSSGTASSEDNNIDMVSTGEELFTGVVPFKFQLKGTINGKSFTVEGEGEGNSHEGSHKGKYVCTSGKLPMSWAALGTSFGYGMKYYTKYPSGLKNWFHEVMPEGFTYDRHIQYKGDGSIHAKHQHFMKNGTYHNIVEFTGQDFKENSPVLTGDMNVSLPNEVQHIPRDDGVECPVTLLYPLLSDKSKCVEAYQNTIIKPLHNQPAPDVPYHWIRKQYTQSKDDTEERDHIIQSETLEAHL,td5oxstaygold,145.08,506,496,156000,,,default,,0.93,td5oxstaygold_default,b,,JVB9K
td,10.1038/s41592-023-02085-6,LC756335,,td5StayGold,,,,MVSTGEELFTGVVPFKFQLKGTINGKSFTVEGEGEGNSHEGSHKGKYVCTSGKLPMSWAALGTSFGYGMKYYTKYPSGLKNWFHEVMPEGFTYDRHIQYKGDGSIHAKHQHFMKNGTYHNIVEFTGQDFKENSPVLTGDMNVSLPNEVQHIPRDDGVECPVTLLYPLLSDKSKCVEAHQNTICKPLHNQPAPDVPYHWIRKQYTQSKDDTEERDHICQSETLEAHLPWHEPSASAVGHGTGSTGSGSSGTASSEDNNIDMVSTGEELFTGVVPFKFQLKGTINGKSFTVEGEGEGNSHEGSHKGKYVCTSGKLPMSWAALGTSFGYGMKYYTKYPSGLKNWFHEVMPEGFTYDRHIQYKGDGSIHAKHQHFMKNGTYHNIVEFTGQDFKENSPVLTGDMNVSLPNEVQHIPRDDGVECPVTLLYPLLSDKSKCVEAHQNTICKPLHNQPAPDVPYHWIRKQYTQSKDDTEERDHICQSETLEAHL,td5staygold,141.05,504,496,155000,,,default,,0.91,td5staygold_default,b,,9BOLR
td,10.1038/s41592-023-02085-6,LC756337,,td8ox2StayGold,,,,MVSTGEELFTGVVPFKFQLKGTINGKSFTVEGEGEGNSHEGSHKGKYVCTSGKLPMSWAALGTSFGYGMKYYTKYPSGLKNWFHEVMPEGFTYDRHIQYKGDGSIHAKHQHFMKNGTYHNIVEFTGQDFKENSPVLTGDMNVSLPNEVQHIPRDDGVECPVTLLYPLLSDKSKCVEAFQNTIIKPLHNQPAPDVPYHWIRKQYTQSKDDTEERDHIIQSETLEAHLYSRTKLEGHGTGSTGSGSSGTASSEDNNIDMVSTGEELFTGVVPFKFQLKGTINGKSFTVEGEGEGNSHEGSHKGKYVCTSGKLPMSWAALGTSFGYGMKYYTKYPSGLKNWFHEVMPEGFTYDRHIQYKGDGSIHAKHQHFMKNGTYHNIVEFTGQDFKENSPVLTGDMNVSLPNEVQHIPRDDGVECPVTLLYPLLSDKSKCVEAFQNTIIKPLHNQPAPDVPYHWIRKQYTQSKDDTEERDHIIQSETLEAHL,td8ox2staygold,147.87,506,496,159000,,,default,,0.93,td8ox2staygold_default,b,,XFHQO
td,10.1038/s41592-023-02085-6,,,td8oxStayGold,,,,MVSTGEELFTGVVPFKFQLKGTINGKSFTVEGEGEGNSHEGSHKGKYVCTSGKLPMSWAALGTSFGYGMKYYTKYPSGLKNWFHEVMPEGFTYDRHIQYKGDGSIHAKHQHFMKNGTYHNIVEFTGQDFKENSPVLTGDMNVSLPNEVQHIPRDDGVECPVTLLYPLLSDKSKCVEAYQNTIIKPLHNQPAPDVPYHWIRKQYTQSKDDTEERDHIIQSETLEAHLYSRTKLEGHGTGSTGSGSSGTASSEDNNIDMVSTGEELFTGVVPFKFQLKGTINGKSFTVEGEGEGNSHEGSHKGKYVCTSGKLPMSWAALGTSFGYGMKYYTKYPSGLKNWFHEVMPEGFTYDRHIQYKGDGSIHAKHQHFMKNGTYHNIVEFTGQDFKENSPVLTGDMNVSLPNEVQHIPRDDGVECPVTLLYPLLSDKSKCVEAYQNTIIKPLHNQPAPDVPYHWIRKQYTQSKDDTEERDHIIQSETLEAHL,td8oxstaygold,146.01,506,496,157000,,,default,,0.93,td8oxstaygold_default,b,,VKDX5
