agg,doi,genbank,ipg_id,name,pdb.0,pdb.1,pdb.2,seq,slug,states.0.brightness,states.0.em_max,states.0.ex_max,states.0.ext_coeff,states.0.lifetime,states.0.maturation,states.0.name,states.0.pka,states.0.qy,states.0.slug,states.1.brightness,states.1.em_max,states.1.ex_max,states.1.ext_coeff,states.1.lifetime,states.1.maturation,states.1.name,states.1.pka,states.1.qy,states.1.slug,switch_type,uniprot,uuid
wd,10.1074/jbc.m102815200,,,Citrine,1HUY,3DPW,,MVSKGEELFTGVVPILVELDGDVNGHKFSVSGEGEGDATYGKLTLKFICTTGKLPVPWPTLVTTFGYGLMCFARYPDHMKQHDFFKSAMPEGYVQERTIFFKDDGNYKTRAEVKFEGDTLVNRIELKGIDFKEDGNILGHKLEYNYNSHNVYIMADKQKNGIKVNFKIRHNIEDGSVQLADHYQQNTPIGDGPVLLPDNHYLSYQSALSKDPNEKRDHMVLLEFVTAAGITLGMDELYK,citrine,58.52,529,516,77000,3.6,,default,5.7,0.76,citrine_default,,,,,,,,,,,b,,VR7EN
wd,10.1038/nmeth.2171,AFR60231,30275454,Clover,5WJ2,,,MVSKGEELFTGVVPILVELDGDVNGHKFSVRGEGEGDATNGKLTLKFICTTGKLPVPWPTLVTTFGYGVACFSRYPDHMKQHDFFKSAMPEGYVQERTISFKDDGTYKTRAEVKFEGDTLVNRIELKGIDFKEDGNILGHKLEYNFNSHNVYITADKQKNGIKANFKIRHNVEDGSVQLADHYQQNTPIGDGPVLLPDNHYLSHQSALSKDPNEKRDHMVLLEFVTAAGITHGMDELYK,clover,84.36,515,505,111000,3.2,30.0,default,6.2,0.76,clover_default,,,,,,,,,,,b,,4Z641
wd,10.1016/0378-1119(95)00685-0,AAB02572,928978,EGFP,2Y0G,4EUL,,MVSKGEELFTGVVPILVELDGDVNGHKFSVSGEGEGDATYGKLTLKFICTTGKLPVPWPTLVTTLTYGVQCFSRYPDHMKQHDFFKSAMPEGYVQERTIFFKDDGNYKTRAEVKFEGDTLVNRIELKGIDFKEDGNILGHKLEYNYNSHNVYIMADKQKNGIKVNFKIRHNIEDGSVQLADHYQQNTPIGDGPVLLPDNHYLSTQSALSKDPNEKRDHMVLLEFVTAAGITLGMDELYK,egfp,33.54,507,488,55900,2.6,25.0,default,6.0,0.6,egfp_default,,,,,,,,,,,b,C5MKY7,R9NL8
td,10.1002/cbic.201600492,,,GRvT,,,,MVSKGEEVIKEFMRFKVRMEGSMNGHEFEIEGEGEGRPYEGTQTAKLKVTKGGPLPFAWDILSPLLMYGSKMYVKHPADIPDYKKLSFPEGFKWVRVMNFEDGGLVTATQDSSLQDGTLIYEVKMRGTNFPPDGPVMQKKTMGWEASTERLYPRDGVLKGEIHQALKLKDGGHYLVEFKTIYMAKKPVQLPGYYYVDTKLDITSHNEDYTRVEQYERSEGRHHLFLYDGSTGSGSSGTMVSKGEEVIKEFMRFKVRMEGSMNGHEFEIEGEGEGRPYEGTQTAKLKVTKGGPLPFAWDILSPQFMYGSKAYVKHPADIPDYKKLSFPEGFKWERVMNFEDGGLVTVTQDSSIQDGTLIYKVKMRGTNFPPDGPVMQKKTMGWEASTERLYPRDGVLKGEIHQALKLKDGGHYLVEFKTIYMAKKPVQLPGYYYVDTKLDITSHNEDYTIVEQYERSEGRHHLFLYGMDELYK,grvt,68.87,583,557,71000,,,Red excitation,2.5,0.97,grvt_red-excitation,36.49,583,477,89000,,,FRET excitation,3.3,0.41,grvt_fret-excitation,b,,H93B4
m,10.1126/science.1068539,,,mCitrine,,,,MVSKGEELFTGVVPILVELDGDVNGHKFSVSGEGEGDATYGKLTLKFICTTGKLPVPWPTLVTTFGYGLMCFARYPDHMKQHDFFKSAMPEGYVQERTIFFKDDGNYKTRAEVKFEGDTLVNRIELKGIDFKEDGNILGHKLEYNYNSHNVYIMADKQKNGIKVNFKIRHNIEDGSVQLADHYQQNTPIGDGPVLLPDNHYLSYQSKLSKDPNEKRDHMVLLEFVTAAGITLGMDELYK,mcitrine,69.56,529,516,94000,,,default,,0.74,mcitrine_default,,,,,,,,,,,b,,3Q37R
m,10.1073/pnas.2000942117,,,mGreenLantern,,,,MVSKGEELFTGVVPILVELDGDVNGHKFSVRGEGEGDATNGKLTLKFICTTGKLPVPWPTLVTTLGYGVACFARYPDHMKQHDFFKSAMPEGYVQERTISFKDDGTYKTRAEVKFEGDTLVNRIVLKGIDFKEDGNILGHKLEYNFNSHKVYITADKQKNGIKANFKTRHNVEDGGVQLADHYQQNTPIGDGPVLLPDNHYLSHQSKLSKDPNEKRDHMVLKERVTAAGITHDMDELYK,mgreenlantern,73.3,514,503,101800,,13.5,default,5.6,0.72,mgreenlantern_default,,,,,,,,,,,b,,G1VL1
m,10.1038/nmeth.2413,AGG56535,34051755,mNeonGreen,5LTP,5LTR,,MVSKGEEDNMASLPATHELHIFGSINGVDFDMVGQGTGNPNDGYEELNLKSTKGDLQFSPWILVPHIGYGFHQYLPYPDGMSPFQAAMVDGSGYQVHRTMQFEDGASLTVNYRYTYEGSHIKGEAQVKGTGFPADGPVMTNSLTAADWCRSKKTYPNDKTIISTFKWSYTTGNGKRYRSTARTTYTFAKPMAANYLKNQPMYVFRKTELKHSKTELNFKEWQKAFTDVMGMDELYK,mneongreen,92.8,517,506,116000,3.1,10.0,default,5.7,0.8,mneongreen_default,,,,,,,,,,,b,,ZRKRV
m,10.1038/s41592-022-01660-7,OP373687,,Monomeric hyperfolder YFP,7UGS,,,MVSKGEELFTGVVPILVELDGDVNGHKFSVRGEGEGDATNGKLTLKLISTTGKLPVPWPTLVTTLGYGLMVFARYPDHMKQHDFFKSAMPEGYVQERTISFEDDGYYKTRAEVKFEGDTLVNRIVLKGIDFKEDGNILGHKLEYNFNPHNVYITADKQKNGIKANFKIRHNVEDGGVQLADHYQQNTPIGDGPVLMPDNHYLSYQSKLSKDPNEKRDHMVLKERVTAAGITHDMNELYK,monomeric-hyperfolder-yfp,76.88,529,515,124000,,27.0,default,5.7,0.62,monomeric-hyperfolder-yfp_default,,,,,,,,,,,b,,PF2S1
m,10.1038/nmeth.4074,APD76535,129830964,mScarlet,5LK4,,,MVSKGEAVIKEFMRFKVHMEGSMNGHEFEIEGEGEGRPYEGTQTAKLKVTKGGPLPFSWDILSPQFMYGSRAFTKHPADIPDYYKQSFPEGFKWERVMNFEDGGAVTVTQDTSLEDGTLIYKVKLRGTNFPPDGPVMQKKTMGWEASTERLYPEDGVLKGDIKMALRLKDGGRYLADFKTTYKAKKPVQMPGAYNVDRKLDITSHNEDYTVVEQYERSEGRHSTGGMDELYK,mscarlet,70.0,594,569,100000,3.9,174.0,default,5.3,0.7,mscarlet_default,,,,,,,,,,,b,,FVS3D
m,10.1038/s41592-023-01809-y,,,mScarlet3,7ZCT,,,MDSTEAVIKEFMRFKVHMEGSMNGHEFEIEGEGEGRPYEGTQTAKLRVTKGGPLPFSWDILSPQFMYGSRAFTKHPADIPDYWKQSFPEGFKWERVMNFEDGGAVSVAQDTSLEDGTLIYKVKLRGTNFPPDGPVMQKKTMGWEASTERLYPEDVVLKGDIKMALRLKDGGRYLADFKTTYRAKKPVQMPGAFNIDRKLDITSHNEDYTVVEQYERSVARHSTGGSGGS,mscarlet3,78.0,592,569,104000,4.0,37.0,default,4.5,0.75,mscarlet3_default,,,,,,,,,,,b,,1AFJZ
m,10.1038/nmeth.4074,APD76536,129830965,mScarlet-I,,,,MVSKGEAVIKEFMRFKVHMEGSMNGHEFEIEGEGEGRPYEGTQTAKLKVTKGGPLPFSWDILSPQFMYGSRAFIKHPADIPDYYKQSFPEGFKWERVMNFEDGGAVTVTQDTSLEDGTLIYKVKLRGTNFPPDGPVMQKKTMGWEASTERLYPEDGVLKGDIKMALRLKDGGRYLADFKTTYKAKKPVQMPGAYNVDRKLDITSHNEDYTVVEQYERSEGRHSTGGMDELYK,mscarlet-i,56.16,593,569,104000,3.1,36.0,default,5.4,0.54,mscarlet-i_default,,,,,,,,,,,b,,6VVTK
m,10.1038/ncomms1738,,,mTurquoise2,3ZTF,,,MVSKGEELFTGVVPILVELDGDVNGHKFSVSGEGEGDATYGKLTLKFICTTGKLPVPWPTLVTTLSWGVQCFARYPDHMKQHDFFKSAMPEGYVQERTIFFKDDGNYKTRAEVKFEGDTLVNRIELKGIDFKEDGNILGHKLEYNYFSDNVYITADKQKNGIKANFKIRHNIEDGGVQLADHYQQNTPIGDGPVLLPDNHYLSTQSKLSKDPNEKRDHMVLLEFVTAAGITLGMDELYK,mturquoise2,27.9,474,434,30000,4.0,33.5,default,3.1,0.93,mturquoise2_default,,,,,,,,,,,b,,7AV5G
m,10.1021/bi0516273,AAZ65844,4596892,mVenus,,,,MVSKGEELFTGVVPILVELDGDVNGHKFSVSGEGEGDATYGKLTLKLICTTGKLPVPWPTLVTTLGYGLQCFARYPDHMKQHDFFKSAMPEGYVQERTIFFKDDGNYKTRAEVKFEGDTLVNRIELKGIDFKEDGNILGHKLEYNYNSHNVYITADKQKNGIKANFKIRHNIEDGGVQLADHYQQNTPIGDGPVLLPDNHYLSYQSKLSKDPNEKRDHMVLLEFVTAAGITLGMDELYK,mvenus,66.56,527,515,104000,2.7,17.6,default,5.5,0.64,mvenus_default,,,,,,,,,,,b,,WCSN6
td,10.1002/cbic.201600492,,,RRvT,,,,MVSKGEEVIKEFMRFKVRMEGSMNGHEFEIEGEGEGRPYEGTQTAKLKVTKGGPLPFAWDILSPQFMYGSKAYVKHPADIPDYKKLSFPEGFKWERVMNFEDGGLVTVTQDSSLQDGTLIYNVKMRGTNFPPDGPVMQKKTMGWEASTERLYPRDGVLKGEIHQALKLKDGGHYLVEFKTIYMAKKPVQLPGYYYVDTKLDITSHNEDYTIVEQYERSEGRHHLFLYGMDELYKGSTGSGSSGPMVSKGEEAIKEFMRFKVSMEGSMNGHEFEIEGEGEGRPYEGTQTAKLKVTKGGPLPFAWDILSPQFMYGSKAYVKHPADIPDYKKLSFPEGFRWERVMNFEDGGLVTVTQDSSIQDGTLIYKVKVRGTNFPPDGPVMQKKTMGWEASTERLYPRDGVLKGEIHQALKLKDGGHYLVEFKTIYMAKKPVQLPGYYYVDTKLDITSHNEDYTVVEQYERSEGRHHLFLYGMDELYK,rrvt,117.92,583,556,134000,,,default,3.9,0.88,rrvt_default,,,,,,,,,,,b,,7GO5D
d,10.1038/s41587-022-01278-2,LC601652.1,,StayGold,8ILK,8ILL,8BXT,MASTPFKFQLKGTINGKSFTVEGEGEGNSHEGSHKGKYVCTSGKLPMSWAALGTSFGYGMKYYTKYPSGLKNWFHEVMPEGFTYDRHIQYKGDGSIHAKHQHFMKNGTYHNIVEFTGQDFKENSPVLTGDMNVSLPNEVQHIPRDDGVECPVTLLYPLLSDKSKCVEAHQNTICKPLHNQPAPDVPYHWIRKQYTQSKDDTEERDHICQSETLEAHL,staygold,147.87,505,496,159000,,14.0,default,4.0,0.93,staygold_default,,,,,,,,,,,b,,71X7X
m,10.1038/s41587-023-02018-w,,,StayGold-E138D,,,,MASTPFKFQLKGTINGKSFTVEGEGEGNSHEGSHKGKYVCTSGKLPMSWAALGTSFGYGMKYYTKYPSGLKNWFHEVMPEGFTYDRHIQYKGDGSIHAKHQHFMKNGTYHNIVEFTGQDFKENSPVLTGDMNVSLPNDVQHIPRDDGVECPVTLLYPLLSDKSKCVEAHQNTICKPLHNQPAPDVPYHWIRKQYTQSKDDTEERDHICQSETLEAHL,staygold-e138d,126.15,504,497,145000,,14.0,default,4.6,0.87,staygold-e138d_default,,,,,,,,,,,b,,Q8WTP
td,10.1038/s41587-022-01278-2,,,tdStayGold,,,,MVSTGEELFTGVVPFKFQLKGTINGKSFTVEGEGEGNSHEGSHKGKYVCTSGKLPMSWAALGTSFGYGMKYYTKYPSGLKNWFHEVMPEGFTYDRHIQYKGDGSIHAKHQHFMKNGTYHNIVEFTGQDFKENSPVLTGDMNVSLPNEVQHIPRDDGVECPVTLLYPLLSDKSKCVEAHQNTICKPLHNQPAPDVPYHWIRKQYTQSKDDTEERDHICQSETLEAHLPWHEPSASAVEFSAGGSAGGSAGGSAGGSAGGSGSAGGSAGGSTSAGGSAGGSAGGSAGGSAGGSGSAGGSAGGSTSAGGSAGGSAGGSAGGSAGGSGSAGGSAGGSTSAGGSAGGSAGGSAGGSAGGKLMVSTGEELFTGVVPFKFQLKGTINGKSFTVEGEGEGNSHEGSHKGKYVCTSGKLPMSWAALGTSFGYGMKYYTKYPSGLKNWFHEVMPEGFTYDRHIQYKGDGSIHAKHQHFMKNGTYHNIVEFTGQDFKENSPVLTGDMNVSLPNEVQHIPRDDGVECPVTLLYPLLSDKSKCVEAHQNTICKPLHNQPAPDVPYHWIRKQYTQSKDDTEERDHICQSETLEAHL,tdstaygold,145.8,504,496,162000,,,default,,0.9,tdstaygold_default,,,,,,,,,,,b,,DOU4X
td,10.1038/nbt1037,AAV52169,3838287,tdTomato,,,,MVSKGEEVIKEFMRFKVRMEGSMNGHEFEIEGEGEGRPYEGTQTAKLKVTKGGPLPFAWDILSPQFMYGSKAYVKHPADIPDYKKLSFPEGFKWERVMNFEDGGLVTVTQDSSLQDGTLIYKVKMRGTNFPPDGPVMQKKTMGWEASTERLYPRDGVLKGEIHQALKLKDGGHYLVEFKTIYMAKKPVQLPGYYYVDTKLDITSHNEDYTIVEQYERSEGRHHLFLGHGTGSTGSGSSGTASSEDNNMAVIKEFMRFKVRMEGSMNGHEFEIEGEGEGRPYEGTQTAKLKVTKGGPLPFAWDILSPQFMYGSKAYVKHPADIPDYKKLSFPEGFKWERVMNFEDGGLVTVTQDSSLQDGTLIYKVKMRGTNFPPDGPVMQKKTMGWEASTERLYPRDGVLKGEIHQALKLKDGGHYLVEFKTIYMAKKPVQLPGYYYVDTKLDITSHNEDYTIVEQYERSEGRHHLFLYGMDELYK,tdtomato,95.22,581,554,138000,,60.0,default,4.7,0.69,tdtomato_default,,,,,,,,,,,b,,PGG5S
wd,10.1038/nbt0102-87,,,Venus,1MYW,,,MVSKGEELFTGVVPILVELDGDVNGHKFSVSGEGEGDATYGKLTLKLICTTGKLPVPWPTLVTTLGYGLQCFARYPDHMKQHDFFKSAMPEGYVQERTIFFKDDGNYKTRAEVKFEGDTLVNRIELKGIDFKEDGNILGHKLEYNYNSHNVYITADKQKNGIKANFKIRHNIEDGGVQLADHYQQNTPIGDGPVLLPDNHYLSYQSALSKDPNEKRDHMVLLEFVTAAGITLGMDELYK,venus,52.55,528,515,92200,3.0,17.6,default,6.0,0.57,venus_default,,,,,,,,,,,b,,YUJWJ
