agg,doi,genbank,ipg_id,name,pdb.0,pdb.1,pdb.2,seq,slug,states.0.brightness,states.0.em_max,states.0.ex_max,states.0.ext_coeff,states.0.lifetime,states.0.maturation,states.0.name,states.0.pka,states.0.qy,states.0.slug,states.1.brightness,states.1.em_max,states.1.ex_max,states.1.ext_coeff,states.1.lifetime,states.1.maturation,states.1.name,states.1.pka,states.1.qy,states.1.slug,switch_type,transitions.0.from_state,transitions.0.to_state,transitions.0.trans_wave,uniprot,uuid
t,10.1038/13657,AAF03369,836144,DsRed,1GGX,1ZGO,1G7K,MRSSKNVIKEFMRFKVRMEGTVNGHEFEIEGEGEGRPYEGHNTVKLKVTKGGPLPFAWDILSPQFQYGSKVYVKHPADIPDYKKLSFPEGFKWERVMNFEDGGVVTVTQDSSLQDGCFIYKVKFIGVNFPSDGPVMQKKTMGWEASTERLYPRDGVLKGEIHKALKLKDGGHYLVEFKSIYMAKKPVQLPGYYYVDSKLDITSHNEDYTIVEQYERTEGRHHLFL,dsred,49.3,583,558,72500,,1600.0,default,,0.68,dsred_default,,,,,,,,,,,b,,,,Q9U6Y8,EGE3L
wd,10.1016/0378-1119(95)00685-0,AAB02572,928978,EGFP,2Y0G,4EUL,,MVSKGEELFTGVVPILVELDGDVNGHKFSVSGEGEGDATYGKLTLKFICTTGKLPVPWPTLVTTLTYGVQCFSRYPDHMKQHDFFKSAMPEGYVQERTIFFKDDGNYKTRAEVKFEGDTLVNRIELKGIDFKEDGNILGHKLEYNYNSHNVYIMADKQKNGIKVNFKIRHNIEDGSVQLADHYQQNTPIGDGPVLLPDNHYLSTQSALSKDPNEKRDHMVLLEFVTAAGITLGMDELYK,egfp,33.54,507,488,55900,2.6,25.0,default,6.0,0.6,egfp_default,,,,,,,,,,,b,,,,C5MKY7,R9NL8
m,10.1038/ncomms2208,,,FusionRed,,,,MVSELIKENMPMKLYMEGTVNNHHFKCTSEGEGKPYEGTQTMRIKVVEGGPLPFAFDILATSFMYGSRTFIKHPPGIPDFFKQSFPEGFTWERVTTYEDGGVLTATQDTSLQDGCLIYNVKVRGVNFPANGPVMQKKTLGWEASTETMYPADGGLEGACDMALKLVGGGHLICNLETTYRSKKPATNLKMPGVYNVDHRLERIKEADDETYVEQHEVAVARYSTGGAGDGGK,fusionred,17.95,608,580,94500,1.8,130.0,default,4.6,0.19,fusionred_default,,,,,,,,,,,b,,,,,S6A7A
t,10.1073/pnas.202320599,BAC20344,,Kaede,,,,MSLIKPEMKIKLLMEGNVNGHQFVIEGDGKGHPFEGKQSMDLVVKEGAPLPFAYDILTTAFHYGNRVFAKYPDHIPDYFKQSFPKGFSWERSLMFEDGGVCIATNDITLKGDTFFNKVRFDGVNFPPNGPVMQKKTLKWEASTEKMYLRDGVLTGDITMALLLKGDVHYRCDFRTTYKSRQEGVKLPGYHFVDHCISILRHDKDYNEVKLYEHAVAHSGLPDNVK,kaede,19.93,580,572,60400,4.2,,Red,5.6,0.33,kaede_red,86.94,518,508,98800,3.4,,Green,5.6,0.88,kaede_green,pc,kaede_green,kaede_red,380,,Q31FH
m,10.1371/journal.pone.0017896,,,mCerulean3,4EN1,,,MVSKGEELFTGVVPILVELDGDVNGHKFSVSGEGEGDATYGKLTLKFICTTGKLPVPWPTLVTTLSWGVQCFARYPDHMKQHDFFKSAMPEGYVQERTIFFKDDGNYKTRAEVKFEGDTLVNRIELKGIDFKEDGNILGHKLEYNAIHGNVYITADKQKNGIKANFGLNCNIEDGSVQLADHYQQNTPIGDGPVLLPDNHYLSTQSKLSKDPNEKRDHMVLLEFVTAAGITLGMDELYK,mcerulean3,34.8,475,433,40000,4.1,69.8,default,3.2,0.87,mcerulean3_default,,,,,,,,,,,b,,,,,TWJXO
m,10.1038/nbt1037,AAV52164,3838123,mCherry,2H5Q,,,MVSKGEEDNMAIIKEFMRFKVHMEGSVNGHEFEIEGEGEGRPYEGTQTAKLKVTKGGPLPFAWDILSPQFMYGSKAYVKHPADIPDYLKLSFPEGFKWERVMNFEDGGVVTVTQDSSLQDGEFIYKVKLRGTNFPSDGPVMQKKTMGWEASSERMYPEDGALKGEIKQRLKLKDGGHYDAEVKTTYKAKKPVQLPGAYNVNIKLDITSHNEDYTIVEQYERAEGRHSTGGMDELYK,mcherry,15.84,610,587,72000,1.4,15.0,default,4.5,0.22,mcherry_default,,,,,,,,,,,b,,,,X5DSL3,ZERB6
m,10.1126/science.1068539,,,mEGFP,,,,MVSKGEELFTGVVPILVELDGDVNGHKFSVSGEGEGDATYGKLTLKFICTTGKLPVPWPTLVTTLTYGVQCFSRYPDHMKQHDFFKSAMPEGYVQERTIFFKDDGNYKTRAEVKFEGDTLVNRIELKGIDFKEDGNILGHKLEYNYNSHNVYIMADKQKNGIKVNFKIRHNIEDGSVQLADHYQQNTPIGDGPVLLPDNHYLSTQSKLSKDPNEKRDHMVLLEFVTAAGITLGMDELYK,megfp,33.6,507,488,56000,,,default,6.0,0.6,megfp_default,,,,,,,,,,,b,,,,,QKFJN
m,10.1038/nmeth.3225,,,mEos4b,,,,MVSAIKPDMRIKLRMEGNVNGHHFVIDGDGTGKPYEGKQTMDLEVKEGGPLPFAFDILTTAFHYGNRVFVKYPDNIQDYFKQSFPKGYSWERSLTFEDGGICNARNDITMEGDTFYNKVRFYGTNFPANGPVMQKKTLKWEPSTEKMYVRDGVLTGDIEMALLLEGNAHYRCDFRTTYKAKEKGVKLPGAHFVDHAIEILSHDKDYNKVKLYEHAVAHSGLPDNARR,meos4b,65.66,516,505,78170,,,Green,5.5,0.84,meos4b_green,39.41,580,570,55500,,,Red,5.8,0.71,meos4b_red,pc,meos4b_green,meos4b_red,405,,V2GB1
m,10.1038/s41592-019-0613-6,,,mEosEM,,,,MVSAIKPDMRIKLRMEGNVNGHHFVIDGEGTGKPYEGKQTMDLEVKEGGPLPFAFDILTTAFHYGNRVFVKYPDNIQDYFKQSFPKGYSWERSMTFEDGGICNARNDITMEGDTFYNKVRFYGTNFPANGPVMQKKTLKWEPSTEKMYVRDGVLTGDIEMALLLEGGAHYRCDFRTTYKAKEKGVKLPGAHFVDHAIEILSHDKDYNKVKLYEHAVAHSGLPDNARR,meosem,122.96,511,503,155650,,,Green,6.0,0.79,meosem_green,112.28,579,569,170128,,,Red,6.5,0.66,meosem_red,pc,meosem_green,meosem_red,405,,DKEXK
m,10.1016/j.cell.2007.12.033,BAG06989,14335281,mKO2,,,,MVSVIKPEMKMRYYMDGSVNGHEFTIEGEGTGRPYEGHQEMTLRVTMAEGGPMPFAFDLVSHVFCYGHRVFTKYPEEIPDYFKQAFPEGLSWERSLEFEDGGSASVSAHISLRGNTFYHKSKFTGVNFPADGPIMQNQSVDWEPSTEKITASDGVLKGDVTMYLKLEGGGNHKCQMKTTYKAAKEILEMPGDHYIGHRLVRKTEGNITEQVEDAVAHS,mko2,39.56,565,551,63800,,108.0,default,5.5,0.62,mko2_default,,,,,,,,,,,b,,,,,134NN
m,10.1038/nmeth.2413,AGG56535,34051755,mNeonGreen,5LTP,5LTR,,MVSKGEEDNMASLPATHELHIFGSINGVDFDMVGQGTGNPNDGYEELNLKSTKGDLQFSPWILVPHIGYGFHQYLPYPDGMSPFQAAMVDGSGYQVHRTMQFEDGASLTVNYRYTYEGSHIKGEAQVKGTGFPADGPVMTNSLTAADWCRSKKTYPNDKTIISTFKWSYTTGNGKRYRSTARTTYTFAKPMAANYLKNQPMYVFRKTELKHSKTELNFKEWQKAFTDVMGMDELYK,mneongreen,92.8,517,506,116000,3.1,10.0,default,5.7,0.8,mneongreen_default,,,,,,,,,,,b,,,,,ZRKRV
m,10.1038/s41592-023-01809-y,,,mScarlet3,7ZCT,,,MDSTEAVIKEFMRFKVHMEGSMNGHEFEIEGEGEGRPYEGTQTAKLRVTKGGPLPFSWDILSPQFMYGSRAFTKHPADIPDYWKQSFPEGFKWERVMNFEDGGAVSVAQDTSLEDGTLIYKVKLRGTNFPPDGPVMQKKTMGWEASTERLYPEDVVLKGDIKMALRLKDGGRYLADFKTTYRAKKPVQMPGAFNIDRKLDITSHNEDYTVVEQYERSVARHSTGGSGGS,mscarlet3,78.0,592,569,104000,4.0,37.0,default,4.5,0.75,mscarlet3_default,,,,,,,,,,,b,,,,,1AFJZ
m,10.1371/journal.pone.0028674,,,mTagBFP2,,,,MVSKGEELIKENMHMKLYMEGTVDNHHFKCTSEGEGKPYEGTQTMRIKVVEGGPLPFAFDILATSFLYGSKTFINHTQGIPDFFKQSFPEGFTWERVTTYEDGGVLTATQDTSLQDGCLIYNVKIRGVNFTSNGPVMQKKTLGWEAFTETLYPADGGLEGRNDMALKLVGGSHLIANAKTTYRSKKPAKNLKMPGVYYVDYRLERIKEANNETYVEQHEVAVARYCDLPSKLGHKLN,mtagbfp2,32.38,454,399,50600,2.6,12.0,default,2.7,0.64,mtagbfp2_default,,,,,,,,,,,b,,,,,ZO7NN
m,10.1038/ncomms1738,,,mTurquoise2,3ZTF,,,MVSKGEELFTGVVPILVELDGDVNGHKFSVSGEGEGDATYGKLTLKFICTTGKLPVPWPTLVTTLSWGVQCFARYPDHMKQHDFFKSAMPEGYVQERTIFFKDDGNYKTRAEVKFEGDTLVNRIELKGIDFKEDGNILGHKLEYNYFSDNVYITADKQKNGIKANFKIRHNIEDGGVQLADHYQQNTPIGDGPVLLPDNHYLSTQSKLSKDPNEKRDHMVLLEFVTAAGITLGMDELYK,mturquoise2,27.9,474,434,30000,4.0,33.5,default,3.1,0.93,mturquoise2_default,,,,,,,,,,,b,,,,,7AV5G
m,10.1021/bi0516273,AAZ65844,4596892,mVenus,,,,MVSKGEELFTGVVPILVELDGDVNGHKFSVSGEGEGDATYGKLTLKLICTTGKLPVPWPTLVTTLGYGLQCFARYPDHMKQHDFFKSAMPEGYVQERTIFFKDDGNYKTRAEVKFEGDTLVNRIELKGIDFKEDGNILGHKLEYNYNSHNVYITADKQKNGIKANFKIRHNIEDGGVQLADHYQQNTPIGDGPVLLPDNHYLSYQSKLSKDPNEKRDHMVLLEFVTAAGITLGMDELYK,mvenus,66.56,527,515,104000,2.7,17.6,default,5.5,0.64,mvenus_default,,,,,,,,,,,b,,,,,WCSN6
m,10.1016/j.chembiol.2008.08.006,,,TagBFP,3M24,,,MSELIKENMHMKLYMEGTVDNHHFKCTSEGEGKPYEGTQTMRIKVVEGGPLPFAFDILATSFLYGSKTFINHTQGIPDFFKQSFPEGFTWERVTTYEDGGVLTATQDTSLQDGCLIYNVKIRGVNFTSNGPVMQKKTLGWEAFTETLYPADGGLEGRNDMALKLVGGSHLIANIKTTYRSKKPAKNLKMPGVYYVDYRLERIKEANNETYVEQHEVAVARYCDLPSKLGHKLN,tagbfp,32.76,457,402,52000,2.6,13.0,default,2.7,0.63,tagbfp_default,,,,,,,,,,,b,,,,,BFJKS
