agg,doi,genbank,ipg_id,name,pdb,pdb.0,pdb.1,pdb.10,pdb.2,pdb.3,pdb.4,pdb.5,pdb.6,pdb.7,pdb.8,pdb.9,seq,slug,states.0.brightness,states.0.em_max,states.0.ex_max,states.0.ext_coeff,states.0.lifetime,states.0.maturation,states.0.name,states.0.pka,states.0.qy,states.0.slug,states.1.brightness,states.1.em_max,states.1.ex_max,states.1.ext_coeff,states.1.lifetime,states.1.maturation,states.1.name,states.1.pka,states.1.qy,states.1.slug,states.2.brightness,states.2.em_max,states.2.ex_max,states.2.ext_coeff,states.2.lifetime,states.2.maturation,states.2.name,states.2.pka,states.2.qy,states.2.slug,states.3.brightness,states.3.em_max,states.3.ex_max,states.3.ext_coeff,states.3.lifetime,states.3.maturation,states.3.name,states.3.pka,states.3.qy,states.3.slug,states.4.brightness,states.4.em_max,states.4.ex_max,states.4.ext_coeff,states.4.lifetime,states.4.maturation,states.4.name,states.4.pka,states.4.qy,states.4.slug,switch_type,transitions.0.from_state,transitions.0.to_state,transitions.0.trans_wave,transitions.1.from_state,transitions.1.to_state,transitions.1.trans_wave,transitions.2.from_state,transitions.2.to_state,transitions.2.trans_wave,transitions.3.from_state,transitions.3.to_state,transitions.3.trans_wave,transitions.4.from_state,transitions.4.to_state,transitions.4.trans_wave,uniprot,uuid
t,10.1371/journal.pone.0002680,AAU06848,3620743,aacuGFP1,,,,,,,,,,,,,MSLSKHGITQEMPTKYHMKGSVNGHEFEIEGVGTGHPYEGTHMAELVIIKPAGKPLPFSFDILSTVIQYGNRCFTKYPADLPDYFKQAYPGGMSYERSFVYQDGGIATASWNVGLEGNCFIHKSTYLGVNFPADGPVMTKKTIGWDKAFEKMTGFNEVLRGDVTEFLMLEGGGYHSCQFHSTYKPEKPVELPPNHVIEHHIVRTDLGKTAKGFMVKLVQHAAAHVNPLKVQ,aacugfp1,22.51,502,478,36900,,,default,,0.61,aacugfp1_default,,,,,,,,,,,,,,,,,,,,,,,,,,,,,,,,,,,,,,,,,b,,,,,,,,,,,,,,,,Q66PV6,498LC
d,10.1101/677344,,,AausGFP,,,,,,,,,,,,,MKIYCEGEKLFKGIVPIQIELNGDVNGHKFSVHGEGQGEAEMGRLTLRFVCTTGKMPVPWPTLVTTFSYGVQCFSRYPEHMKMHDFFKSAMPEGYTQERTIFFDKDGTYKTRAEVKFEGDTLVNRIELTGTGFKEDGNILGHKMEYNYNSHNVYIMSDKAKNGIKVNFKIRHNIEDGTVQLADHYQANYPLGKGPVLLPEDHYLSTQSALTKDPHETRDHMLLLEFVTAAGITHGMDELYK,aausgfp,21.17,503,398,29000,,,default,4.8,0.73,aausgfp_default,,,,,,,,,,,,,,,,,,,,,,,,,,,,,,,,,,,,,,,,,b,,,,,,,,,,,,,,,,,D7QYG
d,10.1038/nbt0396-315,,,&alpha;GFP,,,,,,,,,,,,,MSKGEELFTGVVPILVELDGDVNGHKFSVSGEGEGDATYGKLTLKFICTTGKLPVPWPTLVTTFSYGVQCFSRYPDHMKRHDFFKSAMPEGYVQERTISFKDDGNYKTRAEVKFEGDTLVNRIELKGIDFKEDGNILGHKLEYNYNSHNVYITADKQKNGIKANFKIRHNIEDGSVQLADHYQQNTPIGDGPVLLPDNHYLSTQSALSKDPNEKRDHMVLLEFVTAAGITHGMDELYK,alphagfp,23.7,506,397,30000,,,default,,0.79,alphagfp_default,,,,,,,,,,,,,,,,,,,,,,,,,,,,,,,,,,,,,,,,,b,,,,,,,,,,,,,,,,,B28N7
t,10.1038/13657,AAF03371,1173879,amFP486,,2A46,,,,,,,,,,,MALSNKFIGDDMKMTYHMDGCVNGHYFTVKGEGNGKPYEGTQTSTFKVTMANGGPLAFSFDILSTVFKYGNRCFTAYPTSMPDYFKQAFPDGMSYERTFTYEDGGVATASWEISLKGNCFEHKSTFHGVNFPADGPVMAKKTTGWDPSFEKMTVCDGILKGDVTAFLMLQGGGNYRCQFHTSYKTKKPVTMPPNHVVEHRIARTDLDKGGNSVQLTEHAVAHITSVVPF,amfp486,9.6,486,458,40000,,,default,,0.24,amfp486_default,,,,,,,,,,,,,,,,,,,,,,,,,,,,,,,,,,,,,,,,,b,,,,,,,,,,,,,,,,Q9U6Y6,1M48O
m,10.1093/molbev/msh079,AAR85352,1978504,anm2CP,,,,,,,,,,,,,MEGGPALFQSDMTFKIFIDGVVNDQKFTIIADGSSKFPHGDFNVHAVCETGKLPMSWKPICHLIQYGEPFFAKYPNGISHFAQECFPEGLTIDRTVRFENDGTMTSHHTYELDGTCVISRITVNCDGFQPDGPIMKDQLVDILPTETHMFPHGSNAVRQLCYIGFTTADGGLMMSHFDSKLTFNGSRAIKIPGPHFVTVIIKQMKDTSDKRDHVCQREVTYAHSVPRITSAI,anm2cp,0.12,597,572,120000,,,default,,0.001,anm2cp_default,,,,,,,,,,,,,,,,,,,,,,,,,,,,,,,,,,,,,,,,,b,,,,,,,,,,,,,,,,Q6RYS4,SEJPD
t,10.1371/journal.pone.0002680,AAU06851,3620753,anobCFP1,,,,,,,,,,,,,MSYSKQGIAQVMKTKYHMEGSVNGHEFTIEGVGTGNPYEGTQMSELVITKPAGKPLPFSFDILSTVFQYGNRCFTKYPEGMTDYFKQAFPDGMSYERSFLYEDGGVATASWNIRLERDCFIHKSIYHGVNFPADGPVMKKKTIGWDKAFEKMTVSKDVLRGDVTEFLMLEGGGYHSCQFHSTYKPEKPAALPPNHVVEHHIVRTDLGQSAKGFTVKLEEHAAAHVNPLKVQ,anobcfp1,23.74,490,462,27600,,,default,,0.86,anobcfp1_default,,,,,,,,,,,,,,,,,,,,,,,,,,,,,,,,,,,,,,,,,b,,,,,,,,,,,,,,,,Q66PV3,NPCN7
t,10.1042/bj20051314,,,AQ143,,,,,,,,,,,,,MAPLVTEDMCIKMTMEGTINGHHFKCVGEGEGKPFEGTQVEKIRITEGGPLPFAYDILAPCCMYGSKTFIKHVSGIPDYFKESFPEGFTWERTQIFEDGGSLTIHQDTSLQGNNFIFKVNVIGANFPANGPVMQKKTAGWEPSVEILYPRDGVLCGQALMALKCTDGDHLTSHLRTTYRSRKPSNAVNMPEFHFGDHRIEILKAEQGKFYEQYESAVARYCEAAPSKLGHH,aq143,3.6,655,595,90000,,,default,,0.04,aq143_default,,,,,,,,,,,,,,,,,,,,,,,,,,,,,,,,,,,,,,,,,b,,,,,,,,,,,,,,,,,GW5EB
m,10.1039/c2mb25303h,,,Aquamarine,,,,,,,,,,,,,MVSKGEELFTGVVPILVELDGDVNGHKFSVSGEGEGDATYGKLTLKFICTTGKLPVPWPTLVTTLSWGVQCFSRYPDHMKQHDFFKSAMPEGYVQERTIFFKDDGNYKTRAEVKFEGDTLVNRIELKGIDFKEDGNILGHKLEYNYISGNVYITADKQKNGIKANFKIRHNIEDGSVQLADHYQQNTPIGDGPVLLPDNHYLSTQSALSKDPNEKRDHMVLLEFVTAAGITLGMDELYK,aquamarine,23.14,474,430,26000,4.1,,default,3.3,0.89,aquamarine_default,,,,,,,,,,,,,,,,,,,,,,,,,,,,,,,,,,,,,,,,,b,,,,,,,,,,,,,,,,,963OH
t,10.1042/bj20051314,,,AsRed2,,,,,,,,,,,,,MASLLKKTMPFRTTIEGTVNGHYFKCTGKGEGNPLEGTQEMKIEVIEGGPLPFAFHILSTSCMYGSKAFIKYVSGIPDYFKQSLPEGFTWERTTTYEDGGFLTAHQDTSLDGDCLVYKVKILGNNFPADGPVMQNKAGRWEPSTEIVYEVDGVLRGQSLMALECPGGRHLTCHLHTTYRSKKPASALKMPGFHFEDHRIEILEEVEKGKCYKQYEAAVGRYCDAAPSKLGH,asred2,2.81,592,576,56200,,,default,,0.05,asred2_default,,,,,,,,,,,,,,,,,,,,,,,,,,,,,,,,,,,,,,,,,b,,,,,,,,,,,,,,,,,8TL1P
d,10.1016/0378-1119(92)90691-h,AAA27721,1266562,avGFP,,1GFL,,,,,,,,,,,MSKGEELFTGVVPILVELDGDVNGHKFSVSGEGEGDATYGKLTLKFICTTGKLPVPWPTLVTTFSYGVQCFSRYPDHMKQHDFFKSAMPEGYVQERTIFFKDDGNYKTRAEVKFEGDTLVNRIELKGIDFKEDGNILGHKLEYNYNSHNVYIMADKQKNGIKVNFKIRHNIEDGSVQLADHYQQNTPIGDGPVLLPDNHYLSTQSALSKDPNEKRDHMVLLEFVTAAGITHGMDELYK,avgfp,19.75,509,395,25000,,,default,4.5,0.79,avgfp_default,,,,,,,,,,,,,,,,,,,,,,,,,,,,,,,,,,,,,,,,,b,,,,,,,,,,,,,,,,P42212,1XF1B
,10.1101/677344,,,AvicFP2,,,,,,,,,,,,,MNCGALLFKQKIPFIVELDGDVNGQVFSVRGNGFGDGSIGKIEIKFVCTTGEIPVAWESLVCSLAYGALVFTKYPSNINDFFKSTMPKGYIQERKITFENDGQYETRAEVTYENGALYNRVKLNGSGFRKDGNILGKKLDATSLGTCIYILSNDEGNGLKGVYNMAYKVIDGNRQIVSHQQTNTPIGDGLVSIPDYHVMHNHISCSKDPTEPRDHLILKESVTAVDCQTAYM,avicfp2,2.36,515,480,59000,,,pre-conversion,,0.04,avicfp2_pre-conversion,,,,41000,,,post-conversion,,0.0,avicfp2_post-conversion,,,,,,,,,,,,,,,,,,,,,,,,,,,,,,,b,avicfp2_pre-conversion,avicfp2_post-conversion,480,,,,,,,,,,,,,,FHG23
,10.1101/677344,,,AvicFP4,,,,,,,,,,,,,MDSGALLFKQKIPLVVEFEGDVEGMKFSVRGKGHGDATNGRIEASFICTTGELPVPWSSIISSLTYGFLCFTKYPDGIKDFPKSAMPEGYVQERTISFENDGTYKTRAEVTFENGSVYNRVKLNGEGFNKGGNILGKKLEYSFNPHCIYVLGDKENNGIRCCFNVVHNIVGGGQLIASHSQLNTPLGGGPIAIPEYHHICNHTTLSKDPREPRDHMTVAEVLKAVDCKTAYL,avicfp4,12.1,512,500,121000,,,default,,0.1,avicfp4_default,,,,,,,,,,,,,,,,,,,,,,,,,,,,,,,,,,,,,,,,,b,,,,,,,,,,,,,,,,,LTRTO
wd,10.1038/nbt1264,ABK79091,6379415,Azurite,,,,,,,,,,,,,MSKGEELFTGVVPILVELDGDVNGHKFSVSGEGEGDATYGKLTLKFICTTGKLPVPWPTLVTTLSHGVQCFSRYPDHMKQHDFFKSAMPEGYVQERTIFFKDDGNYKTRAEVKFEGDTLVNRIELKGIDFKEDGNILGHKLEYNFNSHNIYIMADKQKNGIKVNFKIRHNIEDGSVQLADHYQQNTPIGDGPVLLPDNHYLSTQSALSKDPNEKRDHMVLLEFRTAAGITHGMDELYK,azurite,14.41,447,383,26200,3.65,18.0,default,5.0,0.55,azurite_default,,,,,,,,,,,,,,,,,,,,,,,,,,,,,,,,,,,,,,,,,b,,,,,,,,,,,,,,,,,ZMWEJ
d,10.1016/j.bbamcr.2018.08.015,MG727536,,BDFP1.6,,,,,,,,,,,,,MANREVVETLKELLADGEKRVQVAGVIGTNAAEVVKTAVSLLFQEYPELVSPGGCAYTTRRYNMCVRDMNYFLRMCSYAIVAGGASVLDGRMLAGFRDTFNSLGIPLCPAARGIQLMKKIVKEKLATAGMTNIAFVDEPFDYIARVISETEI,bdfp16,19.7,666,642,100000,,,default,,0.197,bdfp16_default,,,,,,,,,,,,,,,,,,,,,,,,,,,,,,,,,,,,,,,,,b,,,,,,,,,,,,,,,,,QNYK6
d,10.1016/j.bbamcr.2019.06.018,MK500863,,BDFP1.8,,,,,,,,,,,,,MANREVVETLKELLADGEKRVQVAGVIGTNAAEVVKTAVSLLFQEYPELVSPGGCAYTTRRYNKCVRDMNYFLRMCSYAIVAGGASVLDGRMLAGLRDTFNSLGIPLGPVARGIQLMKKIVKEKLATAGMTNIAFVDEPFDYIARVISETEI,bdfp18,4.7,702,678,77027,,,default,2.0,0.061,bdfp18_default,,,,,,,,,,,,,,,,,,,,,,,,,,,,,,,,,,,,,,,,,b,,,,,,,,,,,,,,,,,YEOJF
d,10.1038/srep05469,,,bfloGFPc1,,4DKM,,,,,,,,,,,LPTTHEVHVYGSINGVEFDLVGSGKGNPKDGSEEIQVKSTKGPLGFSPYIVVPNIGYGFHQYLPFPDGMSPFQAAADDGSGYVVHRTIQFEDGASLTGNYRYSYDGGHIKGEFHVVGSGFPADGPVMTKSLTAVDWSVATMLFPNDTTVVSTIDWTCPTTSGKRYHATLRTNYTFAKPIAATILQKQPMFVFRKTEVKASDAEINLKEWQKAFHDL,bflogfpc1,0.15,521,493,98800,,,default,,0.0015,bflogfpc1_default,,,,,,,,,,,,,,,,,,,,,,,,,,,,,,,,,,,,,,,,,b,,,,,,,,,,,,,,,,,7AJCQ
d,10.1016/s0960-9822(02)00450-5,,,BFP,,,,,,,,,,,,,MSKGEELFTGVVPILVELDGDVNGHKFSVSGEGEGDATYGKLTLKFICTTGKLPVPWPTLVTTFSHGVQCFSRYPDHMKQHDFFKSAMPEGYVQERTIFFKDDGNYKTRAEVKFEGDTLVNRIELKGIDFKEDGNILGHKLEYNFNSHNVYIMADKQKNGIKVNFKIRHNIEDGSVQLADHYQQNTPIGDGPVLLPDNHYLSTQSALSKDPNEKRDHMVLLEFVTAAGITHGMDELYK,bfp,5.32,445,381,14000,,,default,,0.38,p4-3_default,,,,,,,,,,,,,,,,,,,,,,,,,,,,,,,,,,,,,,,,,b,,,,,,,,,,,,,,,,,SDS4K
wd,10.1038/nbt1264,ABK79092,6379405,BFP.A5,,,,,,,,,,,,,MSKGEELFTGVVPILVELDGDVNGHKFSVSGEGEGDATYGKLTLKFICTTGKLPVPWPTLVTTLSHGVQCFSRYPDHMKQHDFFKSAMPEGYVQERTIFFKDDGNYKTRAEVKFEGDTLVNRIELKGIDFKEDGNILGHKLEYNANSHNIYIMADKQKNGIKANFKIRHNIEDGSVQLADHYQQNTPIGDGPVLLPDNHYLSTQSALSKDPNEKRDHMVLLEFRTAAGITHGMDELYK,bfpa5,13.15,447,383,27400,3.27,,default,,0.48,bfpa5_default,,,,,,,,,,,,,,,,,,,,,,,,,,,,,,,,,,,,,,,,,b,,,,,,,,,,,,,,,,,A6N87
,10.1021/ja908418r,,,Blue102,,3LF4,,,,,,,,,,,EEDNMAIIKEFMRFKVHMEGSVNGHEFEIEGEGEGRPYEGTQTAKLKVTKGGPLPFAWDILSPQFLYGSRAYVKHPADIPDYWKLSFPEGFKWERVMNFEDGGVVTVTQDSSLQDGEFIYKVKLRGTNFPSDGPVMQKKTMGWEAISERMYPEDGALKGEIKQRLKLKDGGHYDAEVKTTYKAKKPVQLPGAYNVNIKLDITSHNEDYTIVEQYERAEGRHSTGGMDELYK,blue102,10.26,454,403,11400,,,Blue form,,0.9,blue102_blue-form,,,,,,,,,,,,,,,,,,,,,,,,,,,,,,,,,,,,,,,,,t,,,,,,,,,,,,,,,,,N8PD5
m,10.1021/acsomega.0c02574,,,BP02,,,,,,,,,,,,,ELSKETALKKSFKFLVLIILWNNTVDAIHI,bp02,0.51,382,342,4494,0.69,,default,,0.1139,blue-fluorescent-protein_default,,,,,,,,,,,,,,,,,,,,,,,,,,,,,,,,,,,,,,,,,b,,,,,,,,,,,,,,,,,7XHKJ
,10.1021/acs.jafc.9b05473,,,BR1,,,,,,,,,,,,,MIEKNYVITDPRLPDNPIIFASDGFLELTGYSREEILGRNARFLQGPETDQATVQKIRDAIRDQRETTVQLINYTKSGRKFWNLLHLQPVRDQKGELQYFIGVQLDGSDRV,br1,5.62,495,450,12500,,,BR1,,0.45,br1_br1,,,,,,,,,,,,,,,,,,,,,,,,,,,,,,,,,,,,,,,,,b,,,,,,,,,,,,,,,,,WH633
m,10.1038/nbt.1493,,,bsDronpa,,,,,,,,,,,,,MSVIKPDMKIKLRMEGAVNGHPFAIEGVGLGKPFEGKQSMDLKVKEGGPLPFAYDILTTAFCYGNRVFTKYPENIVDYFKQSFPEGYSWERSMNYEDGGICNATNDITLDGNCYIYEIRFDGVNFPANGPVMQKRTVKWEQSTEKLYVRDGVLKSDGNCALSLEGGGHYRCDCKTTYKAKKVVQLPDYHFVDHHIEIKSHDKDYSNVNLHEHAEAHSELPRQAK,bsdronpa,22.5,504,460,45000,,,On,,0.5,bsdronpa_on,,,,,,,Off,,,bsdronpa_off,,,,,,,,,,,,,,,,,,,,,,,,,,,,,,,ps,bsdronpa_off,bsdronpa_on,405,bsdronpa_on,bsdronpa_off,488,,,,,,,,,,,DOGBN
d,10.1039/c9pp00067d,,,CagFbFP,,6RHF,,,,,,,,,,,MASGMIVTDAGADQPIVFVNRAFSTITGYAPNEVLGRNARFLQGPQTDAATVARLREAIAAARPIQERILNYRKDGQPFWNQLSISPVRDETGNVVAFVGVQTDVTA,cagfbfp,5.51,497,447,15317,,,default,,0.36,cagfbfp_default,,,,,,,,,,,,,,,,,,,,,,,,,,,,,,,,,,,,,,,,,b,,,,,,,,,,,,,,,,,N9NE1
,,,,CAR-GECO1,,,,,,,,,,,,,MVDSSRRKWNKAGHAVRAIGRLSSPVVSERMYPEDGALKSEIKKGLRLKDGGHYAAEVKTTYKAKKPVQLPGAYIVDIKLDIVSHNEDYTIVEQCERAEGRHSTGGMDELYKGGTGGSLVSKGVEDNMAIVKEFMRFKTHIEGSVNGHEFEIEGEGEGRPYEAFQTAKLKVTKGGPLPFAWDILSPQIMYGSKAYIKHPADIPDYFKLSFPEGFRWERVMNFEDGGIIHVNQDSSLQDGVFIYKVKLRGTNFPPDGPVMQKKTMGWEPTRDQLTEEQIAEFKEAFSLFDKDGDGTITTKELGTVMRSLGQNPTEAELQDMINEVDADGDGTFDFPEFLTMMARKMNDTDSEEEIREAFRVFDKDGNGYIGAAELRHVMTDLGEKLTDEEVDEMIRVADIDGDGQVNYEEFVQMMTAK,car-geco1,0.61,629,576,3580,,,calcium free,8.96,0.17,car-geco1_calcium-free,16.61,609,562,63900,,,calcium saturated,5.29,0.26,car-geco1_calcium-saturated,,,,,,,,,,,,,,,,,,,,,,,,,,,,,,,b,,,,,,,,,,,,,,,,,WZXU4
t,10.1038/13657,AAF03374,910533,cFP484,,,,,,,,,,,,,MKCKFVFCLSFLVLAITNANIFLRNEADLEEKTLRIPKALTTMGVIKPDMKIKLKMEGNVNGHAFVIEGEGEGKPYDGTHTLNLEVKEGAPLPFSYDILSNAFQYGNRALTKYPDDIADYFKQSFPEGYSWERTMTFEDKGIVKVKSDISMEEDSFIYEIRFDGMNFPPNGPVMQKKTLKWEPSTEIMYVRDGVLVGDISHSLLLEGGGHYRCDFKSIYKAKKVVKLPDYHFVDHRIEILNHDKDYNKVTLYENAVARYSLLPSQA,cfp484,16.94,484,456,35300,,,default,,0.48,cfp484_default,,,,,,,,,,,,,,,,,,,,,,,,,,,,,,,,,,,,,,,,,b,,,,,,,,,,,,,,,,Q9U6Y3,O8SH6
,10.1093/nar/28.16.e78,,,CGFP,,,,,,,,,,,,,MSKGEELFTGVVPILVELDGDVNGHKFSVSGEGEGDATYGKLTLKFICTTGKLPVPWPTLVTTLTWGVQCFSRYPDHMKQHDFFKSAMPEGYVQERTIFFKDDGNYKTRAEVKFEGDTLVNRIELKGIDFKEDGNILGHKLEYNYNSHNVYIMADKQKNGIKVNFKIRHNIEDGSVQLADHYQQNTPIGDGPVLLPDNHYLSTQSALSKDPNEKRDHMVLLEFVTAAGITHGMDELYK,cgfp,3.35,506,463,23900,,,default,4.0,0.14,cgfp_default,,,,,,,,,,,,,,,,,,,,,,,,,,,,,,,,,,,,,,,,,b,,,,,,,,,,,,,,,,,5WSHL
,10.1074/jbc.m102815200,,,cpCitrine,,,,,,,,,,,,,DPMVSKGEELFTGVVPILVELDGDVNGHKFSVSGEGEGDATYGKLTLKFILTTGKLPVPWPTLVTTFGYGLMVFARYPDHMKRHDFFKSAMPEGYVQERTIFFKDDGNYKTRAEVKFEGDTLVNRIELKGIDFKEDGNILGHKLEYNYNSHNVYIMADKQKNGIKVNFKIRHNIEDGSVQLADHYQQNTPIGDGPVLLPDNHYLSYQSALSKDPNEKRDHMVLLEFVTAAGITHGMDELYK,cpcitrine,2.0,524,506,20000,,,default,,0.1,cpcitrine_default,,,,,,,,,,,,,,,,,,,,,,,,,,,,,,,,,,,,,,,,,b,,,,,,,,,,,,,,,,,9PBZV
,10.1186/1472-6750-3-5,,,cpT-Sapphire 174-173,,,,,,,,,,,,,,cpt-sapphire-174-173,23.32,511,399,44000,,,default,5.2,0.53,cpt-sapphire-174-173_default,,,,,,,,,,,,,,,,,,,,,,,,,,,,,,,,,,,,,,,,,b,,,,,,,,,,,,,,,,,AJWMF
m,10.1021/sb500237x,,,CreiLOV,,,,,,,,,,,,,MAGLRHTFVVADATLPDCPLVYASEGFYAMTGYGPDEVLGHNARFLQGEGTDPKEVQKIRDAIKKGEACSVRLLNYRKDGTPFWNLLTVTPIKTPDGRVSKFVGVQVDVTSKTEGKALA,creilov,6.38,495,450,12500,,,default,,0.51,creilov_default,,,,,,,,,,,,,,,,,,,,,,,,,,,,,,,,,,,,,,,,,b,,,,,,,,,,,,,,,,,NENVO
t,10.3390/ijms222312887,,,CRISPRed2s,,,,,,,,,,,,,MVSKGEELIKEYMRMKVVMEGSVNGHQFKCTGEGEGRPYEGVQTMRIKVIEGGPLPFAFDILATSFMYGSRTFIKYPADIPDFFKQSFPEGFTWERVTRYEDGGVVTVTQDTSLEDGELVYNVKVSGVNFPSNGPVMQKKTKGWEADTEMMYPADGGLRGYLDRALKVDGGGHLHCNFVTTYRSKKTVGDIKMPGVHAVDHRLERIEESDNETYVVQREVAVAKYSDLGGGMDELYK,crispred2s,10.96,590,464,28700,,90.0,default,2.23,0.382,crispred2s_default,,,,,,,,,,,,,,,,,,,,,,,,,,,,,,,,,,,,,,,,,b,,,,,,,,,,,,,,,,,M59JJ
wd,10.1038/nbt1066,,,CyPet,,,,,,,,,,,,,MVSKGEELFGGIVPILVELEGDVNGHKFSVSGEGEGDATYGKLTLKFICTTGKLPVPWPTLVTTLTWGVQCFSRYPDHMKQHDFFKSVMPEGYVQERTIFFKDDGNYKTRAEVKFEGDTLVNRIELKGIDFKEDGNILGHKLEYNYISHNVYITADKQKNGIKANFKARHNITDGSVQLADHYQQNTPIGDGPVILPDNHYLSTQSALSKDPNEKRDHMVLLEFVTAAGITHGMDELYK,cypet,17.85,477,435,35000,,,default,5.02,0.51,cypet_default,,,,,,,,,,,,,,,,,,,,,,,,,,,,,,,,,,,,,,,,,b,,,,,,,,,,,,,,,,,V534T
,10.1038/nbt945,,,D10,,,,,,,,,,,,,MVSKGEELFTGVVPILVELDGDVNGHKFSVSGEGEGDATYGKLTLKFICTTGKLPVPWPTLVTTLTWGVQCFARYPDHMKQHDFFKSAMPEGYVQERTIFFKDDGNYKTRAEVKFEGDTLVNRIELKGIDFKEDGNILGHKLEYNGISDNVYITADKQKNGIKANFKIRHNIEDGSVQLADHYQQNTPIGDGPVLLPDNHYLSTQSALSKDPNEKRDHMVLLEFVTAAGITLGMDELYK,d10,20.24,475,433,44000,,,default,,0.46,d10_default,,,,,,,,,,,,,,,,,,,,,,,,,,,,,,,,,,,,,,,,,b,,,,,,,,,,,,,,,,,GHBKT
d,10.1073/pnas.0403668101,,,d1EosFP,,,,,,,,,,,,,MSAIKPDMKINLRMEGNVNGHHFVIDGDGTGKPFEGKQSMDLEVKEGGPLPFAFDILTTAFHYGNRVFAEYPDHIQDYFKQSFPKGYSWERSLTFEDGGICIARNDITMEGDTFYNKVRFHGTNFPANGPVMQKKTLKWEPSTEKMYVRDGVLTGDITMALLLEGNAHYRCDFRTTYKAKEKGVKLPGYHFVDHCIEILSHDKDYNKVKLYEHAVAHSGLPDNARR,d1eosfp,50.86,516,505,74800,,,Green,,0.68,d1eosfp_green,24.8,581,571,40000,,,Red,,0.62,d1eosfp_red,,,,,,,,,,,,,,,,,,,,,,,,,,,,,,,pc,d1eosfp_green,d1eosfp_red,405,,,,,,,,,,,,,,YLRRG
d,10.1073/pnas.0403668101,,,d2EosFP,,,,,,,,,,,,,MSAIKPDMKINLRMEGNVNGHHFVIDGDGTGKPFEGKQSMDLEVKEGGPLPFAFDILTTAFHYGNRVFAEYPDHIQDYFKQSFPKGYSWERSLTFEDGGICIARNDITMEGDTFYNKVRFHGVNFPANGPVMQKKTLKWEPSTEKMYVRDGVLTGDIHMALLLEGNAHYRCDFRTTYKAKEKGVKLPGYHFVDHCIEILSHDKDYNKVKLYEHAVAHSGLPDNARR,d2eosfp,55.44,516,506,84000,,,Green,,0.66,d2eosfp_green,19.8,581,569,33000,,,Red,,0.6,d2eosfp_red,,,,,,,,,,,,,,,,,,,,,,,,,,,,,,,pc,d2eosfp_green,d2eosfp_red,405,,,,,,,,,,,,,,1SEDF
d,10.3390/ijms222312887,,,dCyOFP2s,,,,,,,,,,,,,MVSKGEELIKENMRSKLYLEGSVNGHQFKCTHEGEGKPYEGKQTNRIKVVEGGPLPFAFDILATHFMYGSKVFIKYPADLPDYFKQSFPEGFTWERVMVFEDGGVLTATQDTSLQDGELIYNVKVRGVNFPANGPVMQKKTLGWEPSTETMYPADGGLEGRCDKALKLVGGGHLHVSFKTTYKSKKPVKMPGVHYVDRRLERIKEADNETYVEQYEHAVARYSNLGGGMDELYK,dcyofp2s,24.84,592,510,36000,,24.0,default,5.29,0.69,dcyofp2s_default,,,,,,,,,,,,,,,,,,,,,,,,,,,,,,,,,,,,,,,,,b,,,,,,,,,,,,,,,,,2DGCJ
d,10.3390/ijms222312887,,,dCyRFP2s,,,,,,,,,,,,,MVSKGEELIKESMRSKLYLEGSVNGHQFKCIHEGEGKPYEGKQTARIKVVEGGPLPFAFDILATMFMYGSKVFIKYPADLPDYFKQSFPEGFTWERVMVFEDGGVLTATQDTSLQDGGLIYNVKLRGVNFPAYGPVMQKKTLGWEPSTETMYPADGGLEGRCDKLLKLVGGGHLHVNFKTTYRSKKPVKMPGVHYVDRRLERIKEADNETYVEQYEHAVARYSNLGGGMDELYK,dcyrfp2s,24.36,592,516,42000,,75.0,default,5.44,0.58,dcyrfp2s_default,,,,,,,,,,,,,,,,,,,,,,,,,,,,,,,,,,,,,,,,,b,,,,,,,,,,,,,,,,,54XX1
,10.1021/bi026609p,,,deGFP1,,1JBZ,1JBY,,,,,,,,,,MSKGEELFTGVVPILVELDGDVNGHKFSVSGEGEGDATYGKLTLKFICTTGKLPVPWPTLVTTFTYGVQCFSRYPDHMKRHDFFKSAMPEGYVQERTIFFKDDGNYKTRAEVKFEGDTLVNRIELKGIDFKEDGNILGHKLEYNYNSGNVYIMADKQKNGIKVNFKIRHNIEDGSVQLADHYQQNTPIGDGPVLLPDNHYLSCQSALSKDPNEKRDHMVLLEFVTAAGITHGMDELYK,degfp1,4.59,516,504,28700,,,default,8.02,0.16,degfp1_default,,,,,,,,,,,,,,,,,,,,,,,,,,,,,,,,,,,,,,,,,b,,,,,,,,,,,,,,,,,THWKH
,10.1021/bi026609p,,,deGFP2,,,,,,,,,,,,,MSKGEELFTGVVPILVELDGDVNGHKFSVSGEGEGDATYGKLTLKFISTTGKLPVPWPTLVTTFTYGVQCFSRYPDHMKQHDFFKSAMPEGYVQERTIFFKDDGNYKTRAEVKFEGDTLVNRIELKGIDFKEDGNILGHKLEYNYNSCNVYIMADKQKNGIKVNFKIRHNIEDGSVQLADHYQQNTPIGDGPVLLPDNHYLSTQSALSKDPNEKRDHMVLLEFVTAAGITHGMDELYK,degfp2,7.38,517,496,21700,,,default,7.25,0.34,degfp2_default,,,,,,,,,,,,,,,,,,,,,,,,,,,,,,,,,,,,,,,,,b,,,,,,,,,,,,,,,,,MGNCD
,10.1021/bi026609p,,,deGFP3,,,,,,,,,,,,,MSKGEELFTGVVPILVELDGDVNGHKFSVSGEGEGDATYGKLTLKFICTTGKLPVPWPTLVTTFTYGVQCFSRYPDHMKQHDFFKSAMPEGYVQERTIFFKDDGNYKTRAEVKFEGDTLVNRIELKGIDFKEDGNILGHKLEYNYNSHNVYIMADKQKNGIKVNFKIRHNIEDGSVQLADHYQQNTPIGDGPVLLPDNHYLSCQSALSKDPNEKRDHMVLLEFVTAAGITHGMDELYK,degfp3,5.07,518,508,26700,,,default,6.86,0.19,degfp3_default,,,,,,,,,,,,,,,,,,,,,,,,,,,,,,,,,,,,,,,,,b,,,,,,,,,,,,,,,,,B72B1
,10.1021/bi026609p,,,deGFP4,,,,,,,,,,,,,MSKGEELFTGVVPILVELDGDVNGHKFSVSGEGEGDATYGKLTLKFISTTGKLPVPWPTLVTTFTYGVQCFSRYPDHMKQHDFFKSAMPEGYVQERTIFFKDDGNYKTRAEVKFEGDTLVNRIELKGIDFKEDGNILGHKLEYNYNSCNVYIMADKQKNGIKVNFKIRHNIEDGSVQLADHYQQNTPIGDGPVLLPDNHYLSCQSALSKDPNEKRDHMVLLEFVTAAGITHGMDELYK,degfp4,4.04,518,509,26900,,,default,7.37,0.15,degfp4_default,,,,,,,,,,,,,,,,,,,,,,,,,,,,,,,,,,,,,,,,,b,,,,,,,,,,,,,,,,,LDZC9
m,10.1038/nbt1191,,,Dendra,,,,,,,,,,,,,MNLIKEDMRVKVHMEGNVNGHAFVIEGEGKGKPYEGTQTANLTVKEGAPLPFSYDILTTAVHYGNRVFTKYPEDIPDYFKQSFPEGYSWERTMTFEDKGICTIRSDISLEGDCFFQNVRFKGTNFPPNGPVMQKKTLKWEPSTEKLHVRDGLLVGNINMALLLEGGGHYLCDFKTTYKAKKVVQLPDAHFVDHRIEILGNDSDYNKVKLYEHAVARYSPLPSQAW,dendra,14.7,505,488,21000,,,Green,6.6,0.7,dendra_green,14.4,575,556,20000,,,Red,6.9,0.72,dendra_red,,,,,,,,,,,,,,,,,,,,,,,,,,,,,,,pc,dendra_green,dendra_red,405,,,,,,,,,,,,,,GJDTN
m,10.1038/nbt1191,,,Dendra2,,2VZX,,,,,,,,,,,MNTPGINLIKEDMRVKVHMEGNVNGHAFVIEGEGKGKPYEGTQTANLTVKEGAPLPFSYDILTTAVHYGNRVFTKYPEDIPDYFKQSFPEGYSWERTMTFEDKGICTIRSDISLEGDCFFQNVRFKGTNFPPNGPVMQKKTLKWEPSTEKLHVRDGLLVGNINMALLLEGGGHYLCDFKTTYKAKKVVQLPDAHFVDHRIEILGNDSDYNKVKLYEHAVARYSPLPSQVW,dendra2,22.5,507,490,45000,3.3,,Green,6.6,0.5,dendra2_green,19.25,573,553,35000,4.4,,Red,6.9,0.55,dendra2_red,,,,,,,,,,,,,,,,,,,,,,,,,,,,,,,pc,dendra2_green,dendra2_red,480,dendra2_green,dendra2_red,405,,,,,,,,,,,GE6KO
m,10.1021/jacs.5b09923,,,Dendra2-T69A,,,,,,,,,,,,,MNTPGINLIKEDMRVKVHMEGNVNGHAFVIEGEGKGKPYEGTQTANLTVKEGAPLPFSYDILTTAVHYGNRVFAKYPEDIPDYFKQSFPEGYSWERTMTFEDKGICTIRSDISLEGDCFFQNVRFKGTNFPPNGPVMQKKTLKWEPSTEKLHVRDGLLVGNINMALLLEGGGHYLCDFKTTYKAKKVVQLPDAHFVDHRIEILGNDSDYNKVKLYEHAVARYSPLPSQVW,dendra2-t69a,23.8,518,502,42500,3.0,,Green,6.0,0.56,dendra2-t69a_green,22.66,578,563,35400,4.2,,Orange,7.0,0.64,dendra2-t69a_orange,,,,,,,,,,,,,,,,,,,,,,,,,,,,,,,pc,dendra2-t69a_green,dendra2-t69a_orange,405,,,,,,,,,,,,,,XKDOQ
d,10.1038/nbt1207,BAE93225,5593673,dKeima,,,,,,,,,,,,,MVSVIAKQMTYKVYMSGTVNGHYFEVEGDGKGKPYEGEQTVKLTVTKGGPLPFAWDILSPLFQYGSIPFTKYPEDIPDYVKQSFPEGYTWERTMNFEDGAVCTVSNDSSIQGNCFIYNVKISGTNFPPNGPVMQKKTQGWEPSTERLFARDGMLIGNDYMALKLEGGGHYLCEFKSTYKAKKPVRMPGYHYIDRKLDVTSHNRDYTSVEQCEIAIARHSLLG,dkeima,7.63,616,440,24600,2.78,,default,6.5,0.31,dkeima_default,,,,,,,,,,,,,,,,,,,,,,,,,,,,,,,,,,,,,,,,,b,,,,,,,,,,,,,,,,Q1JV71,LMJV4
d,10.1038/nbt1207,BAE94262,5680967,dKeima570,,,,,,,,,,,,,MVSVIAKQMTYKVYMSGTVNGHYFEVEGDGKGKPYEGEQTVKLTVTKGGPLPFAWDILSPLMCYGSIPFTKYPEDIPDYVKQSFPEGYTWERTMNFEDGAVCTVSNDSSIQGNCFIYNVKISGTNFPPNGPVMQKKTQGWEPSTERLFARDGMLIGNDYMALKLEGGGHYLCEFKSTYKAKKPVRMPGYHYIDRKLDVTSHNRDYTSVEQCEIAIARHSLLG,dkeima570,2.1,570,440,14000,,,default,,0.15,dkeima570_default,,,,,,,,,,,,,,,,,,,,,,,,,,,,,,,,,,,,,,,,,b,,,,,,,,,,,,,,,,Q1JU63,BUJNN
m,10.1529/biophysj.107.105882,,,Dronpa-2,,,,,,,,,,,,,MSVIKPDMKIKLRMEGAVNGHPFAIEGVGLGKPFEGKQSMDLKVKEGGPLPFAYDILTTVFCYGNRVFAKYPENIVDYFKQSFPEGYSWERSMNYEDGGICNATNDITLDGDCYIYEIRFDGVNFPANGPVMQKRTVKWEPSTEKLYVRDGVLKGDVNTALSLEGGGHYRCDFKTTYKAKKVVQLPDYHFVDHHIEIKSHDKDYSNVNLHEHAEAHSELPRQAK,dronpa-2,20.37,515,490,61732,,,On,,0.33,dronpa-2_on,,,,,,,Off,,,dronpa-2_off,,,,,,,,,,,,,,,,,,,,,,,,,,,,,,,ps,dronpa-2_on,dronpa-2_off,490,dronpa-2_off,dronpa-2_on,405,,,,,,,,,,,52ADP
m,10.1529/biophysj.107.105882,,,Dronpa-3,,,,,,,,,,,,,MSVIKPDMKIKLRMEGAVNGHPFAIEGVGLGKPFEGKQSMDLKVKEGGPLPFAYDILTTVFCYGNRVFAKYPENIVDYFKQSFPEGYSWERSMNYEDGGICNATNDITLDGDCYIYEIRFDGVNFPANGPVMQKRTVKWEPSTEKLYVRDGVLKGDINAALSLEGGGHYRCDFKTTYKAKKVVQLPDYHFVDHHIEIKSHDKDYSNVNLHEHAEAHSELPRQAK,dronpa-3,19.14,515,490,58000,,,On,,0.33,dronpa-3_on,,,,,,,Off,,,dronpa-3_off,,,,,,,,,,,,,,,,,,,,,,,,,,,,,,,ps,dronpa-3_off,dronpa-3_on,405,dronpa-3_on,dronpa-3_off,490,,,,,,,,,,,42Q3E
t,10.1038/13657,AAF03370,200279,dsFP483,,3CGL,,,,,,,,,,,MSCSKSVIKEEMLIDLHLEGTFNGHYFEIKGKGKGQPNEGTNTVTLEVTKGGPLPFGWHILCPQFQYGNKAFVHHPDNIHDYLKLSFPEGYTWERSMHFEDGGLCCITNDISLTGNCFYYDIKFTGLNFPPNGPVVQKKTTGWEPSTERLYPRDGVLIGDIHHALTVEGGGHYACDIKTVYRAKKAALKMPGYHYVDTKLVIWNNDKEFMKVEEHEIAVARHHPFYEPKKDK,dsfp483,10.99,483,443,23900,,,default,,0.46,dsfp483_default,,,,,,,,,,,,,,,,,,,,,,,,,,,,,,,,,,,,,,,,,b,,,,,,,,,,,,,,,,Q9U6Y7,YG5WM
t,10.1038/nbt0102-83,GQ268961,,DsRed-Express,,,,,,,,,,,,,MASSEDVIKEFMRFKVRMEGSVNGHEFEIEGEGEGRPYEGTQTAKLKVTKGGPLPFAWDILSPQFQYGSKVYVKHPADIPDYKKLSFPEGFKWERVMNFEDGGVVTVTQDSSLQDGSFIYKVKFIGVNFPSDGPVMQKKTMGWEASTERLYPRDGVLKGEIHKALKLKDGGHYLVEFKSIYMAKKPVQLPGYYYVDSKLDITSHNEDYTIVEQYERAEGRHHLFL,dsred-express,12.64,586,554,30100,,42.0,default,4.8,0.42,dsred-express_default,,,,,,,,,,,,,,,,,,,,,,,,,,,,,,,,,,,,,,,,,b,,,,,,,,,,,,,,,,,DCYCK
,10.1038/nmeth.1264,ACJ05619,15756136,DsRed-Express2,,,,,,,,,,,,,MDSTENVIKPFMRFKVHMEGSVNGHEFEIEGEGEGKPYEGTQTAKLQVTKGGPLPFAWDILSPQFQYGSKVYVKHPADIPDYKKLSFPEGFKWERVMNFEDGGVVTVTQDSSLQDGTFIYHVKFIGVNFPSDGPVMQKKTLGWEPSTERLYPRDGVLKGEIHKALKLKGGGHYLVEFKSIYMAKKPVKLPGYYYVDSKLDITSHNEDYTVVEQYERAEARHHLFQ,dsred-express2,14.95,591,554,35600,,42.0,default,,0.42,dsred-express2_default,,,,,,,,,,,,,,,,,,,,,,,,,,,,,,,,,,,,,,,,,b,,,,,,,,,,,,,,,,,5DP2R
m,10.1093/protein/gzm046,,,DsRed.M1,,2VAD,,,,,,,,,,,MDNTEDVIKEFMQFKVRMEGSVNGHYFEIEGEGEGKPYEGTQTAKLQVTKGGPLPFAWDILSPQFQYGSKAYVKHPADIPDYMKLSFPEGFTWERSMNFEDGGVVEVQQDSSLQDGTFIYKVKFKGVNFPADGPVMQKKTAGWEPSTEKLYPQDGVLKGEISHALKLKDGGHYTCDFKTVYKAKKPVQLPGNHYVDSKLDITNHNEDYTVVEQYEHAEARHSGSQ,dsredm1,3.82,587,558,27300,1.4,,default,,0.14,dsredm1_default,,,,,,,,,,,,,,,,,,,,,,,,,,,,,,,,,,,,,,,,,b,,,,,,,,,,,,,,,,,N33JN
t,10.1038/nmeth.1264,ACJ05620,,DsRed-Max,,2V4E,,,,,,,,,,,MDSTENVIKPFMRFKVHMEGSVNGHEFEIEGEGEGKPYEGTQTAKLQVTKGGPLPFAWDILSPQFMYGSKVYTKHPADIPDYKKLSFPEGFKWERVMNFEDGGVVTVTQDSSLQDGTFIYHVKFIGVNFPSDGPVMQKKTLGWEPSTERLYPRDGVLKGEIHKALKLKGGGHYLCEFKSIYMAKKPVKLPGYYYVDSKLDITSHNEDYTVVEQYERTEARHHLFQ,dsred-max,19.68,589,560,48000,,72.0,default,,0.41,dsred-max_default,,,,,,,,,,,,,,,,,,,,,,,,,,,,,,,,,,,,,,,,,b,,,,,,,,,,,,,,,,,UVJD2
t,10.1038/nbt0102-83,,,DsRed.T4,,2VAE,,,,,,,,,,,MASSEDVIKEFMRFKVRMEGSVNGHEFEIEGEGEGRPYEGTQTAKLKVTKGGPLPFAWDILSPQFQYGSKVYVKHPADIPDYKKLSFPEGFKWERVMNFEDGGVVTVTQDSSLQDGCFIYKVKFIGVNFPSDGPVMQKKTMGWEPSTERLYPRDGVLKGEIHKALKLKDGGHYLVEFKSIYMAKKPVQLPGYYYVDSKLDITSHNEDYTIVEQYERAEGRHHLFL,dsredt4,13.33,586,555,30300,,42.6,default,,0.44,dsredt4_default,,,,,,,,,,,,,,,,,,,,,,,,,,,,,,,,,,,,,,,,,b,,,,,,,,,,,,,,,,,XHBTX
m,10.1016/j.bpj.2014.06.040,,,DyLight549P1,,,,,,,,,,,,,,dylight549p1,0.01,575,550,150,,,default,,0.091,dylight549p1_default,,,,,,,,,,,,,,,,,,,,,,,,,,,,,,,,,,,,,,,,,b,,,,,,,,,,,,,,,,,T41B7
t,10.1186/1472-6750-9-32,FJ498891,,E2-Orange,,,,,,,,,,,,,MDSTENVIKPFMRFKVHMEGSVNGHEFEIEGEGEGKPYEGTQTAKLQVTKGGPLPFAWDILSPQFTYGSKAYVKHPADIPDYKKLSFPEGFKWERVMNFEDGGVVTVTQDSSLQDGTFIYHVKFIGVNFPSDGPVMQKKTLGWEPSTERLYPRDGVLKGEIHKALKLKGGGHYLVEFKTIYMAKKPVKLPGYYYVDSKLDITSHNEDYTVVEQYERAEARHHLFQ,e2-orange,19.71,561,540,36500,,78.0,default,4.5,0.54,e2-orange_default,,,,,,,,,,,,,,,,,,,,,,,,,,,,,,,,,,,,,,,,,b,,,,,,,,,,,,,,,,,A3B6M