agg,doi,genbank,ipg_id,name,pdb.0,pdb.1,pdb.2,seq,slug,states.0.brightness,states.0.em_max,states.0.ex_max,states.0.ext_coeff,states.0.lifetime,states.0.maturation,states.0.name,states.0.pka,states.0.qy,states.0.slug,switch_type,uniprot,uuid
wd,10.1016/0378-1119(95)00685-0,AAB02572,928978,EGFP,2Y0G,4EUL,,MVSKGEELFTGVVPILVELDGDVNGHKFSVSGEGEGDATYGKLTLKFICTTGKLPVPWPTLVTTLTYGVQCFSRYPDHMKQHDFFKSAMPEGYVQERTIFFKDDGNYKTRAEVKFEGDTLVNRIELKGIDFKEDGNILGHKLEYNYNSHNVYIMADKQKNGIKVNFKIRHNIEDGSVQLADHYQQNTPIGDGPVLLPDNHYLSTQSALSKDPNEKRDHMVLLEFVTAAGITLGMDELYK,egfp,33.54,507,488,55900,2.6,25.0,default,6.0,0.6,egfp_default,b,C5MKY7,R9NL8
m,10.1038/s41592-024-02203-y,,,mBaoJin,8QBJ,8Q79,8QDD,MVSKGEEENMASTPFKFQLKGTINGKSFTVEGEGEGNSHEGSHKGKYVCTSGKLPMSWAALGTTFGYGMKYYTKYPSGLKNWFREVMPGGFTYDRHIQYKGDGSIHAKHQHFMKNGTYHNIVEFTGQDFKENSPVLTGDMNVSLPNEVPQIPRDDGVECPVTLLYPLLSDKSKYVEAHQYTICKPLHNQPAPDVPYHWIRKQYTQSKDDAEERDHICQSETLEAHLKGMDELYK,mbaojin,119.04,508,500,128000,3.1,7.6,default,4.37,0.93,mbaojin_default,b,,4XHVQ
m,10.21203/rs.3.rs-3188559/v1,,,mBaoJin-N137K,,,,,mbaojin-n137k,49.61,510,504,72949,,,default,,0.68,mbaojin-n137k_default,b,,VBNF5
m,10.21203/rs.3.rs-3188559/v1,,,mBaoJin-S134P,,,,,mbaojin-s134p,58.3,510,502,70245,,,default,,0.83,mbaojin-s134p_default,b,,YM2UC
m,10.21203/rs.3.rs-3188559/v1,,,mBaoJin-T55S,,,,MVSKGEEENMASTPFKFQLKGTINGKSFTVEGEGEGNSHEGSHKGKYVCTSGKLPMSWAALGTSFGYGMKYYTKYPSGLKNWFREVMPGGFTYDRHIQYKGDGSIHAKHQHFMKNGTYHNIVEFTGQDFKENSPVLTGDMNVSLPNEVPQIPRDDGVECPVTLLYPLLSDKSKYVEAHQYTICKPLHNQPAPDVPYHWIRKQYTQSKDDAEERDHICQSETLEAHLKGMDELYK,mbaojin-t55s,109.22,508,497,127000,,,default,,0.86,mbaojin-t55s_default,b,,KEBCT
m,10.21203/rs.3.rs-3188559/v1,,,mBaoJin-V152E,,,,,mbaojin-v152e,69.63,508,498,114146,,,default,,0.61,mbaojin-v152e_default,b,,K655P
m,10.1126/science.1068539,,,mEGFP,,,,MVSKGEELFTGVVPILVELDGDVNGHKFSVSGEGEGDATYGKLTLKFICTTGKLPVPWPTLVTTLTYGVQCFSRYPDHMKQHDFFKSAMPEGYVQERTIFFKDDGNYKTRAEVKFEGDTLVNRIELKGIDFKEDGNILGHKLEYNYNSHNVYIMADKQKNGIKVNFKIRHNIEDGSVQLADHYQQNTPIGDGPVLLPDNHYLSTQSKLSKDPNEKRDHMVLLEFVTAAGITLGMDELYK,megfp,33.6,507,488,56000,,,default,6.0,0.6,megfp_default,b,,QKFJN
m,10.1073/pnas.2000942117,,,mGreenLantern,,,,MVSKGEELFTGVVPILVELDGDVNGHKFSVRGEGEGDATNGKLTLKFICTTGKLPVPWPTLVTTLGYGVACFARYPDHMKQHDFFKSAMPEGYVQERTISFKDDGTYKTRAEVKFEGDTLVNRIVLKGIDFKEDGNILGHKLEYNFNSHKVYITADKQKNGIKANFKTRHNVEDGGVQLADHYQQNTPIGDGPVLLPDNHYLSHQSKLSKDPNEKRDHMVLKERVTAAGITHDMDELYK,mgreenlantern,73.3,514,503,101800,,13.5,default,5.6,0.72,mgreenlantern_default,b,,G1VL1
m,10.1038/nmeth.2413,AGG56535,34051755,mNeonGreen,5LTP,5LTR,,MVSKGEEDNMASLPATHELHIFGSINGVDFDMVGQGTGNPNDGYEELNLKSTKGDLQFSPWILVPHIGYGFHQYLPYPDGMSPFQAAMVDGSGYQVHRTMQFEDGASLTVNYRYTYEGSHIKGEAQVKGTGFPADGPVMTNSLTAADWCRSKKTYPNDKTIISTFKWSYTTGNGKRYRSTARTTYTFAKPMAANYLKNQPMYVFRKTELKHSKTELNFKEWQKAFTDVMGMDELYK,mneongreen,92.8,517,506,116000,3.1,10.0,default,5.7,0.8,mneongreen_default,b,,ZRKRV
m,10.1038/s41592-023-02085-6,LC756333,,mStayGold,,,,MVSTGEELFTGVVPFKFQLKGTINGKSFTVEGEGEGNSHEGSHKGKYVCTSGKLPMSWAALGTSFGYGMKYYTKYPSGLKNWFHEVMPEGFTYDRHIQYKGDGSIHAKHQHFMKNGTYHNIVEFTGQDFKENSPVLTGDMDVSLPNEVQHIPIDDGVECTVTLQYPLLSDESKCVEAYQNTIIKPLHNQPAPDVPFHWIRKQYTQSKDDTEERDHIIQSETLEAHL,mstaygold,136.12,510,499,164000,2.79,,default,4.8,0.83,mstaygold_default,b,,5H7QY
d,10.1038/s41587-022-01278-2,LC601652.1,,StayGold,8ILK,8ILL,8BXT,MASTPFKFQLKGTINGKSFTVEGEGEGNSHEGSHKGKYVCTSGKLPMSWAALGTSFGYGMKYYTKYPSGLKNWFHEVMPEGFTYDRHIQYKGDGSIHAKHQHFMKNGTYHNIVEFTGQDFKENSPVLTGDMNVSLPNEVQHIPRDDGVECPVTLLYPLLSDKSKCVEAHQNTICKPLHNQPAPDVPYHWIRKQYTQSKDDTEERDHICQSETLEAHL,staygold,147.87,505,496,159000,,14.0,default,4.0,0.93,staygold_default,b,,71X7X
