agg,doi,genbank,ipg_id,name,pdb.0,seq,slug,states.0.brightness,states.0.em_max,states.0.ex_max,states.0.ext_coeff,states.0.lifetime,states.0.maturation,states.0.name,states.0.pka,states.0.qy,states.0.slug,switch_type,uniprot,uuid
t,10.1371/journal.pone.0002680,AAU06848,3620743,aacuGFP1,,MSLSKHGITQEMPTKYHMKGSVNGHEFEIEGVGTGHPYEGTHMAELVIIKPAGKPLPFSFDILSTVIQYGNRCFTKYPADLPDYFKQAYPGGMSYERSFVYQDGGIATASWNVGLEGNCFIHKSTYLGVNFPADGPVMTKKTIGWDKAFEKMTGFNEVLRGDVTEFLMLEGGGYHSCQFHSTYKPEKPVELPPNHVIEHHIVRTDLGKTAKGFMVKLVQHAAAHVNPLKVQ,aacugfp1,22.51,502,478,36900,,,default,,0.61,aacugfp1_default,b,Q66PV6,498LC
t,10.1371/journal.pone.0002680,AAU06845,3620755,aacuGFP2,,MSYSKQGIVQEMKTKYRMEGSVNGHEFTIEGVGTGYPYEGKQMSELVIIKPKGKPLPFSFDILSSVFQYGNRCFTKYPADMPDYFKQAFPDGMSYERSFLFEDGAVATASWNIRLEGNCFIHNSIFHGVNFPADGPVMKKKTIGWDKSFEKMTVSKEVLRGDVTMFLMLEGGGYHRCQFHSTYKTEKPVELPPNHVVEHQIVRTDLGQSAKGFTVKLEAHAAAHVNPLKVQ,aacugfp2,66.67,513,502,93900,,,default,,0.71,aacugfp2_default,b,Q66PV9,3W5ZV
t,10.1371/journal.pone.0002680,AAU06857,3620756,afraGFP,,MSVIVKEMMTKLHMEGTVNGHAFTIEGKGKGDPYNGVQSMNLDVKGGAPLPFSFDLLTPAFMYGNRVFTKYPEDIPDFFKQVFPEGYHWERSITFEDQAVCTATSHIRLDQKEMCFIYDVRFHGVNFPANGPIMQKKILGWEPSTEKMYARDGVLKGDVNMTLRVEGGGHYRADFRTTYKAKKPVNLPGYHFIDHRIEITKHSKDYTNVALYEAAVARHSPLPKVA,afragfp,61.49,503,494,100800,,,default,,0.61,afragfp_default,b,Q66PU5,T5A9C
t,10.1038/13657,AAF03371,1173879,amFP486,2A46,MALSNKFIGDDMKMTYHMDGCVNGHYFTVKGEGNGKPYEGTQTSTFKVTMANGGPLAFSFDILSTVFKYGNRCFTAYPTSMPDYFKQAFPDGMSYERTFTYEDGGVATASWEISLKGNCFEHKSTFHGVNFPADGPVMAKKTTGWDPSFEKMTVCDGILKGDVTAFLMLQGGGNYRCQFHTSYKTKKPVTMPPNHVVEHRIARTDLDKGGNSVQLTEHAVAHITSVVPF,amfp486,9.6,486,458,40000,,,default,,0.24,amfp486_default,b,Q9U6Y6,1M48O
t,10.3354/meps07588,ACH89428,15616242,amilFP512,,MSYSKQGIVQEMKTKYHMEGSVNGHEFTIEGVGTGYPYEGKQMSELVIIKPAGKPLPFSFDILSSVFQYGNRCFTKYPADMPDYFKQAFPDGMSYERSFLFEDGAVATASWKIRLEGNCFIHNSIFHGVNFPADGPVMKKKTIGWDKSFEKMTVSKEVLRGDVTMFLMLEGGGSHRCQFHSTYKTEKPVTLPPNHVVEHQIVRTDLGQSAKGFTVKLEAHAAAHVNPLKVK,amilfp512,,512,500,,,,default,,,amilfp512_default,b,B5T1L4,Q3VS4
t,10.3354/meps07588,ACH89429,15616243,amilFP597,,MALSKHGLTKDMTMKYHMEGSVDGHKFVITGHGNGNPFEGKQTVNLCVAEGGPLPFSEDILSAAFDYGNRVFTEYPQGMVDFFKNSCPAGYTWHRSLLFEDGAVCTTSADITVSVEENCFYHNSKFHGVNFPADGPVMKKMTTNWEPSCEKIIPVPRQGILKGDIAMYLLLKDGGRYRCQFDTIYKAKSDPKEMPEWHFIQHKLTREDRSDAKNQKWQLVEHAVASRSALPG,amilfp597,,597,558,,,,default,,,amilfp597_default,b,B5T1L5,2YKB1
t,10.1371/journal.pone.0002680,ABB17956,4901576,eechGFP1,,MSVINPDMKIKLYMEGAVNGHKFEIKGEGNGKPFEGKQTMDLAVVDGGPLPFAFDILTTSFNYGNRVFTKYPDTIVDYFKPSFPEGYSWERSMTYEDGGICIATNDITLLKDTDDSNYFYYKIRFDGVNFAANGPVMQKKTAKWEPSTEKMYVRDGVLKGEVNMALLLEGGGHYRCDFKTTYKAKKVVRLPSYHFVDHRIEILSHSKDYNQVRLHEHAEAHSGLPRQAK,eechgfp1,93.15,510,497,124200,,,default,,0.75,eechgfp1_default,b,A8CLQ1,MX4SD
t,10.1371/journal.pone.0002680,ABB17968,4901521,eechGFP2,,MNVIKPDMKIKLRMEGAVNGHKFAIEGEGNGQPFEGKQTMNLKVKEGGPLPFAYDILTTIFNYGNRVFVKYPDDIVDYFKQSFPEGYSWERSMIYEDGGICIATNDITLEGDCFVYKIRFDGVNFPAKSPVLQKMTKKWEPSTEKLYVRDGVLKGDVNMALLLEGGGHFRCDFKTTYKAKKVVQLPDYHFVDHRIEIMSHDKDYNNVKLCEHAEAHSGLPGQAK,eechgfp2,75.76,520,506,109800,,,default,,0.69,eechgfp2_default,b,A8CLW1,37XMD
t,10.1371/journal.pone.0002680,ABB17969,4901511,eechGFP3,,MNVIKPDMKIRLRMEGAVNGHKFVIIGKGDGKPYEGTQTMDLEVIEGGPLPFAFDILTTVFKYGNRAFVKYPTDIADYFKQSFPEGFSWERSMTYEDGGICIATNDITLSKDIANCFDYNIRFDGVNFPPNSPVLQKTTIKWEPSTENMYVRDGVLKGDINMSLLLEGGAGHYRCDFKTTYKAKKAVKLPDYHFVDHRITIVSHDKDYNKVKLREHAEAHSGLQMEAK,eechgfp3,54.27,524,512,120600,,,default,,0.45,eechgfp3_default,b,A8CLW4,31NFQ
t,10.1371/journal.pone.0002680,ABB17970,4901480,efasCFP,,MSFSKQVLNDVTMTYFMEGSVNGHDFTIEGEGTGKPYEGHQRFNLRVTKGAPLPFAVDILSAAFAYGNRCFTKYPKEIPDFFKQSLPEDMSWERTMTFEDGGIVAISAHIRLIGNRFEHKSKFVGVNFPADGPVMQRKTLGWEPSSEKMTPRDGILKGYVPSFLVLQGGGNYRCDYDTSYRAMKPVEMPGGHFIQHRIVRRDIKKDSNGNTWQIQEDAFAHNSEVPDSA,efascfp,31.06,490,466,40333,,,default,,0.77,efascfp_default,b,A8CLW9,OSFMK
t,10.1371/journal.pone.0002680,ABB17958,4901483,efasGFP,,MALSKQGIQTDMKMTYSMEGCVNGHNFTVKGGGDGNPYEGHQELRLCITMAKGEPVPFAFDILSAAFCYGNRCFTKYPDEIRDYFKQAFPGGLSWERSMAFEDGASAAVTAEISLEGDCFEHECEFVGVNFPANGPVMQKKTQGWETSTEKMTAHGKVVQGNVPMFLKLEGGGRHRCDFRTTYKAKKDVKMPNSHFITHCLVRKGDGNNTELIEDAEARN,efasgfp,100.64,507,496,125800,,,default,,0.8,efasgfp_default,b,A8CLR1,5EU5J
t,10.1371/journal.pone.0002680,ACD13196,14926077,eforCP,7SWT,MSVIKQVMKTKLHLEGTVNGHDFTIEGKGEGKPYEGLQHMKMTVTKGAPLPFSVHILTPSHMYGSKPFNKYPADIPDYHKQSFPEGMSWERSMIFEDGGVCTASNHSSINLQENCFIYDVKFHGVNLPPDGPVMQKTIAGWEPSVETLYVRDGMLKSDTAMVFKLKGGGHHRVDFKTTYKAKKPVKLPEFHFVEHRLELTKHDKDFTTWDQQEAAEGHFSPLPKALP,eforcp,17.81,609,589,111300,,,default,,0.16,eforcp_default,b,B6CTZ7,TDA9A
t,10.1371/journal.pone.0002680,ABB17967,4901580,gfasCP,7SWR,MSVIAKQMTYKVYMSGTVNGHYFEVEGDGKGKPYEGEQTVKLTVTKGGPLPFAWDILSPQSQYGSIPFTKYPEDIPDYVKQSFPEGYTWERIMNFEDGAVCTVSNDSSIQGNCFIYHVKFSGLNFPPNGPVMQKKTQGWEPNTERLFARDGMLIGNNFMALKLEGGGHYLCEFKSTYKAKKPVKMPGYHYVDRKLDVTNHNKDYTSVEQCEISIARKSVVA,gfascp,,,577,205200,,,default,,,gfascp_default,,A8CLV6,OXU4P
t,10.1371/journal.pone.0002680,ABB17962,4901546,gfasGFP,,MNVIKPDMKIKLCMRGTINGHNFVIEGEGKGNPYEGTQILDLNVTEGAPLPFAYDILTTVFQYGNRAFTKYPADIQDYFKQTFPEGYHWERSMTYEDQGICTATSNISMRGDCFFYDIRFDGVNFPPNGPVMQKKTLKWEPSTEKMYVRDGVLKGDVNMALLLEGGGHYRCDFKTTYKAKKDVRLPDYHFVDHRIEILKHDKDYNKVELYENAVARYSMLPSQAK,gfasgfp,74.83,506,492,102500,,,default,,0.73,gfasgfp_default,b,A8CLT2,ASMG7
t,10.1371/journal.pone.0002680,ABB17954,4901533,meffCFP,,MALSKQSLPSDMKLIYHMDGNVNGHSFVIKGEGEGKPYEGTHTIKLQVVEGSPLPFSADILSTVFQYGNRCFTKYPPNIVDYFKNSCSGGGYKFGRSFLYEDGAVCTASGDITLSADKKSFEHKSKFLGVNFPADGPVMKKETTNWEPSCEKMTPNGMTLIGDVTGFLLKEDGKRYKCQFHTFHDAKDKSKKMPMPDFHFVQHKIERKDLPGSMQTWRLTEHAAACKTCFTE,meffcfp,48.73,492,467,88600,,,default,,0.55,meffcfp_default,b,A8CLP2,73TKS
t,10.1371/journal.pone.0002680,ABB17950,4901553,meffCP,,MSVIAKQMTYKVYMSGTVNGHYFEVEGDGKGKPYEGEQTVKLTVTKGGPLPFAWDILSPLSQYGSIPFTKYPEDIPDYVKQSFPEGYTWERIMNFEDGAVCTVSNDSSIQGNCFIYNVKISGVNFPPNGPVMQKKTQGWEPNTERLFARDGMLIGNNFMALKLEGGGYYLCEFKSTYKAKKPVRMPGYHYVDRKLDVTSHNKDYTFVEQCEISIARHSLLG,meffcp,,,574,118300,,,default,,,meffcp_default,,A8CLM1,C7XMS
t,10.1371/journal.pone.0002680,ABB17952,4901499,meffRFP,,MALSKNGLTKNMTTKYRMEGCVDGHKFVITGDGIGDPFEGKQTSIDLCVVEGGPLPFSEDILSAVFDYGNRVFTKYPQDLVDYFKNSCPAGYTWQRSFLFEDGAVCTASADITVSVEENCFYHESKFHGVNFPADGPVMKKMTTNWEPSCEKITPIPNEGILKGDVTMFLLLKDGGRYRCQFDTVYKAKSDPKTIMMPDWHFIQHKLNREDRSDAKHQKWRLVENAIAYRSTLS,meffrfp,55.78,576,560,99600,,,default,,0.56,meffrfp_default,b,A8CLN4,ND36H
t,10.1371/journal.pone.0002680,ABB17955,4901448,meleCFP,,MSVIKTDMKIRLQMQGAVNGHPFVITGEGEGKPYEGKHTINLTVQDGGPLPFAFDILTTAFQYGNRVFTKYPKDIPDYFKQSFPAGYSWERCMTFEDGGLCTVSSHIKIEGDYFTYDIRFHGVNFPAGGPVMQKKTLRWEPSTENMYVRDGVLVGEVERTLLLEGNKHHRCNFRTTYKAKKEVVLPEYHFVDHRIEILGHDKDYNNVVVYENAVARQQASTLPSKAK,melecfp,35.08,485,454,47400,,,default,,0.74,melecfp_default,b,A8CLP7,KKQNA
t,10.1371/journal.pone.0002680,ABB17959,4901479,meleRFP,,MSVIKPDMKLKLRMEGTVNGHYFVIEGDGKGRPFEGKQSMDLDVKEGGPLPFAYDILTTAFHYGNRVFAEYPDHIPDYFKQSFPGGYSWERSLTFEDGGICIARNDIKMVGDTFYNTVRFDGVNFPPNGPVMQRRTQKWEPSTEKIYVRDGVLTGDITMALLLEGGVHYRCDFRTTYKAKEKGVQLPGYHFVDHCIEILSHDKDYNKVKLYEHAVAHSGLPDNKRQ,melerfp,38.76,579,573,45600,,,default,,0.85,melerfp_default,b,A8CLR7,UWMXB
t,10.1371/journal.pone.0002680,ABB17965,4901536,mmilCFP,,MALPKQMKLTYHMEGTVNGHFFIIKGEGGGEPYEGTHTIKLQVVEGSPLPFSPDILSTVFQYGNRCFTKYPPNIVDYFKNSCSGGGYTFGRSFLYEDGAVCTASGDITLSSDKSSFEHKSKFLGVNFPADGPVMKKETTNWEPSCEKMTPNGMTLIGDVTEFLLKKDGKRYKCQFHTFHDAKEKSRNMPMPDFHFVQHEIERKDLPGPMQTWQLTEHAAACKNCFTE,mmilcfp,38.25,492,404,42500,,,default,,0.9,mmilcfp_default,b,A8CLU7,QB1DP
t,10.1371/journal.pone.0002680,ACD13194,14926075,plamGFP,,MEIEDVIKRDMKIKLRMEGAVNGHKFVIIGNGDGKPYEGTQTIDLEVIEGAPLPFAFDILTTVFEYGNRVFAKYPNEIVDYFKQSFPEGYSWERSMTYEDGGICIATNNITLSKVIDNCFHYNIRFDGVNFPPKSPVLQKTTMKWEPSTEIMYVRDGVLKGDVNMALLIEGGGHYRCDFKTIYKAKKVVELPDYHFVDHRITIKSHDKDYNKVLLHEHAKARYGLQRKAK,plamgfp,94.66,514,502,98600,,,default,,0.96,plamgfp_default,b,B6CTZ5,4UCC6
t,10.1371/journal.pone.0002680,AAU06843,3620751,scubRFP,,MSAIKTVVKQFMKIKMSLEGTVNGHYFKIVGEGDGTPFEGKQTLHLKVKEGAPLPFAYDILTTALHYGNRVFVEYPENIPDYFKQSFPKGYSWERSLTFEDGGICIARSDIKMVGDTFHNEVQFYGVNFPANGPVMQRHTVKWEPSTEKIYVRDGVLTGDITMALLLKGGTHYRCDFRTTYKAKEKGPKFPGYHLVDHCIEITSHDKDYNVVELYEHAVAHSGLPDSANR,scubrfp,39.84,578,570,66400,,,default,,0.6,scubrfp_default,b,Q66PW1,AJCVH
