agg,doi,genbank,ipg_id,name,pdb.0,pdb.1,seq,slug,states.0.brightness,states.0.em_max,states.0.ex_max,states.0.ext_coeff,states.0.lifetime,states.0.maturation,states.0.name,states.0.pka,states.0.qy,states.0.slug,states.1.brightness,states.1.em_max,states.1.ex_max,states.1.ext_coeff,states.1.lifetime,states.1.maturation,states.1.name,states.1.pka,states.1.qy,states.1.slug,switch_type,uniprot,uuid
t,,,,amCyan1,,,MALSNKFIGDDMKMTYHMDGCVNGHYFTVKGEGSGKPYEGTQTSTFKVTMANGGPLAFSFDILSTVFMYGNRCFTAYPTSMPDYFKQAFPDGMSYERTFTYEDGGVATASWEISLKGNCFEHKSTFHGVNFPADGPVMAKMTTGWDPSFEKMTVCDGILKGDVTAFLMLQGGGNYRCQFHTSYKTKKPVTMPPNHAVEHRIARTDLDKGGNSVQLTEHAVAHITSVVPF,amcyan1,,486,453,,,,default,,,amcyan1_default,,,,,,,,,,,b,,L5QET
t,10.1038/13657,AAF03371,1173879,amFP486,2A46,,MALSNKFIGDDMKMTYHMDGCVNGHYFTVKGEGNGKPYEGTQTSTFKVTMANGGPLAFSFDILSTVFKYGNRCFTAYPTSMPDYFKQAFPDGMSYERTFTYEDGGVATASWEISLKGNCFEHKSTFHGVNFPADGPVMAKKTTGWDPSFEKMTVCDGILKGDVTAFLMLQGGGNYRCQFHTSYKTKKPVTMPPNHVVEHRIARTDLDKGGNSVQLTEHAVAHITSVVPF,amfp486,9.6,486,458,40000,,,default,,0.24,amfp486_default,,,,,,,,,,,b,Q9U6Y6,1M48O
t,10.3354/meps07588,ACH89426,15616240,amilFP484,,,MSYSKQGIVQEMKTKYHMEGSVNGHEFTIEGVGTGNPYEGTQMSELVITKPAGKPLPFSFDILSTVFQYGNRCFTKYPEGMTDYFKQAFPDGMSYERSFLYEDGGVATASWNIRLERDCFIHKSIYHGVNFPADGPVMKKKTIGWDKAFEKMTVSKDVLRGDVTEFLMLEGGGYHSCQFHSTYKPEKPVTLPPNHVVEHHIVRTDLGQRAKGFTVKLEEHAAAHVNPLKVK,amilfp484,,484,420,,,,default,,,amilfp484_default,,,,,,,,,,,b,B5T1L2,9MM4N
,10.1002/jemt.20410,AAU06849,3620749,amilFP490,,,MSYSKQGIAQVMKTKYHMEGSVNGHEFTIEGVGTGNPYEGTQMSELVITKPAGKPLPFSFDILSTVFQYGNRCFTKYPEGMTDYFKQAFPDGMSFERSFLYEDGGVATASWNIRLERDCFIHKSIYHGVNFPADGPVMKKKTIGWDKAFEKMTVSKDVLRGDVTEFLMLEGGGYHSCQFHSTYKPEKPVTLPPNHVVEHHIVRTDLGQTAKGFTVKLEEHAAAHVNPLKVQ,amilfp490,26.55,490,424,29500,,,default,,0.9,amilfp490_default,,,,,,,,,,,b,Q66PV5,VAXZZ
t,10.1371/journal.pone.0002680,AAU06851,3620753,anobCFP1,,,MSYSKQGIAQVMKTKYHMEGSVNGHEFTIEGVGTGNPYEGTQMSELVITKPAGKPLPFSFDILSTVFQYGNRCFTKYPEGMTDYFKQAFPDGMSYERSFLYEDGGVATASWNIRLERDCFIHKSIYHGVNFPADGPVMKKKTIGWDKAFEKMTVSKDVLRGDVTEFLMLEGGGYHSCQFHSTYKPEKPAALPPNHVVEHHIVRTDLGQSAKGFTVKLEEHAAAHVNPLKVQ,anobcfp1,23.74,490,462,27600,,,default,,0.86,anobcfp1_default,,,,,,,,,,,b,Q66PV3,NPCN7
t,10.3354/meps07588,ACH89424,15616238,apulFP483,,,MSYSKQGIVQVMKTKYHMEGSVNGHEFTIEGVGTGNPYEGTQMSELVITKPAGKPLPFSFDILSTVFQYGNRCFTKYPEGMTDYFKQAFPDGMSYERSFLYEDGGVATASWNIRLERDCFIHKSIYHGVNFPADGPVMKKKTIGWDKAFEKMTVSKDVLRGDVTEFLMLEGGGYHSCQFHSTYKPEKPAALPPNHVVEHHIVRTDLGQSAKGFTVKLEEHAAAHVNPLKVK,apulfp483,,483,420,,,,default,,,apulfp483_default,,,,,,,,,,,b,B5T1L0,VAPCK
m,10.1039/c2mb25303h,,,Aquamarine,,,MVSKGEELFTGVVPILVELDGDVNGHKFSVSGEGEGDATYGKLTLKFICTTGKLPVPWPTLVTTLSWGVQCFSRYPDHMKQHDFFKSAMPEGYVQERTIFFKDDGNYKTRAEVKFEGDTLVNRIELKGIDFKEDGNILGHKLEYNYISGNVYITADKQKNGIKANFKIRHNIEDGSVQLADHYQQNTPIGDGPVLLPDNHYLSTQSALSKDPNEKRDHMVLLEFVTAAGITLGMDELYK,aquamarine,23.14,474,430,26000,4.1,,default,3.3,0.89,aquamarine_default,,,,,,,,,,,b,,963OH
,10.1016/j.bbrc.2005.04.166,,,avGFP454,,,MSKGEELFTGVVPILVELDGDVNGHKFSVSGEGEGDATYGKLTLKFICTTGKLPVPWPTLVTTFSYAVQCFSRYPDHMKQHDFFKSAMPEGYVQERTIFFKDDGNYKTRAEVKFEGDTLVNRIELKGIDFKEDGNILGHKLEYNYNSHNVYIMADKQKNGIKVNFKIRHNIEDGSVQLADHYQQNTPIGDGPVLLPDNHYLSTQSALSKDPNEKRDHMVLLEFVTAAGITHGMDELYK,avgfp454,,454,410,,,,default,,,avgfp454_default,,,,,,,,,,,b,,T4B2J
,10.1515/bc.2004.038,,,avGFP480,1RM9,,VSKGEELFTGVVPILVELDGDVNGHKFSVSGEGEGDATYGKLTLKFICTTGKLPVPWPTLVTTLGYGVQCFSRYPDHMKRHDFFKSAMPEGYVQERTIFFKDDGNYKTRAEVKFEGDTLVNRIELKGIDFKEDGNILGHKLEYNYISHNVYITADKQKNGIKANFKIRHNIEDGSVQLADHYQQNTPIGDGPVLLPDNHYLSTQSALSKDPNEKRDHMVLLEFVTAAGITLGMDELYK,avgfp480,,480,456,,,,default,,,avgfp480_default,,,,,,,,,,,b,,QPRJJ
wd,10.1038/nbt1264,ABK79091,6379415,Azurite,,,MSKGEELFTGVVPILVELDGDVNGHKFSVSGEGEGDATYGKLTLKFICTTGKLPVPWPTLVTTLSHGVQCFSRYPDHMKQHDFFKSAMPEGYVQERTIFFKDDGNYKTRAEVKFEGDTLVNRIELKGIDFKEDGNILGHKLEYNFNSHNIYIMADKQKNGIKVNFKIRHNIEDGSVQLADHYQQNTPIGDGPVLLPDNHYLSTQSALSKDPNEKRDHMVLLEFRTAAGITHGMDELYK,azurite,14.41,447,383,26200,3.65,18.0,default,5.0,0.55,azurite_default,,,,,,,,,,,b,,ZMWEJ
d,10.1016/s0960-9822(02)00450-5,,,BFP,,,MSKGEELFTGVVPILVELDGDVNGHKFSVSGEGEGDATYGKLTLKFICTTGKLPVPWPTLVTTFSHGVQCFSRYPDHMKQHDFFKSAMPEGYVQERTIFFKDDGNYKTRAEVKFEGDTLVNRIELKGIDFKEDGNILGHKLEYNFNSHNVYIMADKQKNGIKVNFKIRHNIEDGSVQLADHYQQNTPIGDGPVLLPDNHYLSTQSALSKDPNEKRDHMVLLEFVTAAGITHGMDELYK,bfp,5.32,445,381,14000,,,default,,0.38,p4-3_default,,,,,,,,,,,b,,SDS4K
,10.1016/0378-1119(95)00768-7,,,BFP5,,,MSKGEELFTGVVPILVELDGDVNGHKFSVSGEGEGDATYGKLTLKFICTTGKLPVPWPTLVTTMSHGIQCFSRYPDHMKQHDFFKSAMPEGYVQERTIFFKDDGNYKTRAEVKFEGDTLVNRIELKGIDFKEDGNILGHKLEYNYNSHNVYIMADKQKNGIKVNFKIRHNIEDGSVQLADHYQQNTPIGDGPVLLPDNHYLSTQSALSKDPNEKRDHMVLLEFVTAAGITHGMDELYK,bfp5,,450,385,,,,default,,,bfp5_default,,,,,,,,,,,b,,RSDF7
wd,10.1038/nbt1264,ABK79092,6379405,BFP.A5,,,MSKGEELFTGVVPILVELDGDVNGHKFSVSGEGEGDATYGKLTLKFICTTGKLPVPWPTLVTTLSHGVQCFSRYPDHMKQHDFFKSAMPEGYVQERTIFFKDDGNYKTRAEVKFEGDTLVNRIELKGIDFKEDGNILGHKLEYNANSHNIYIMADKQKNGIKANFKIRHNIEDGSVQLADHYQQNTPIGDGPVLLPDNHYLSTQSALSKDPNEKRDHMVLLEFRTAAGITHGMDELYK,bfpa5,13.15,447,383,27400,3.27,,default,,0.48,bfpa5_default,,,,,,,,,,,b,,A6N87
,10.1021/ja908418r,,,Blue102,3LF4,,EEDNMAIIKEFMRFKVHMEGSVNGHEFEIEGEGEGRPYEGTQTAKLKVTKGGPLPFAWDILSPQFLYGSRAYVKHPADIPDYWKLSFPEGFKWERVMNFEDGGVVTVTQDSSLQDGEFIYKVKLRGTNFPSDGPVMQKKTMGWEAISERMYPEDGALKGEIKQRLKLKDGGHYDAEVKTTYKAKKPVQLPGAYNVNIKLDITSHNEDYTIVEQYERAEGRHSTGGMDELYK,blue102,10.26,454,403,11400,,,Blue form,,0.9,blue102_blue-form,,,,,,,,,,,t,,N8PD5
wd,10.1038/nbt945,,,Cerulean,2Q57,2WSO,MVSKGEELFTGVVPILVELDGDVNGHKFSVSGEGEGDATYGKLTLKFICTTGKLPVPWPTLVTTLTWGVQCFARYPDHMKQHDFFKSAMPEGYVQERTIFFKDDGNYKTRAEVKFEGDTLVNRIELKGIDFKEDGNILGHKLEYNAISDNVYITADKQKNGIKANFKIRHNIEDGSVQLADHYQQNTPIGDGPVLLPDNHYLSTQSALSKDPNEKRDHMVLLEFVTAAGITLGMDELYK,cerulean,26.66,475,433,43000,3.3,,default,4.7,0.62,cerulean_default,,,,,,,,,,,b,,CVUYM
d,10.1073/pnas.91.26.12501,,,CFP,,,MSKGEELFTGVVPILVELDGDVNGHKFSVSGEGEGDATYGKLTLKFICTTGKLPVPWPTLVTTFSWGVQCFSRYPDHMKQHDFFKSAMPEGYVQERTIFFKDDGNYKTRAEVKFEGDTLVNRIELKGIDFKEDGNILGHKLEYNYNSHNVYIMADKQKNGIKVNFKIRHNIEDGSVQLADHYQQNTPIGDGPVLLPDNHYLSTQSALSKDPNEKRDHMVLLEFVTAAGITHGMDELYK,cfp,,480,456,,,,default,,,cfp_default,,,,,,,,,,,b,,ZRLU4
t,10.1038/13657,AAF03374,910533,cFP484,,,MKCKFVFCLSFLVLAITNANIFLRNEADLEEKTLRIPKALTTMGVIKPDMKIKLKMEGNVNGHAFVIEGEGEGKPYDGTHTLNLEVKEGAPLPFSYDILSNAFQYGNRALTKYPDDIADYFKQSFPEGYSWERTMTFEDKGIVKVKSDISMEEDSFIYEIRFDGMNFPPNGPVMQKKTLKWEPSTEIMYVRDGVLVGDISHSLLLEGGGHYRCDFKSIYKAKKVVKLPDYHFVDHRIEILNHDKDYNKVTLYENAVARYSLLPSQA,cfp484,16.94,484,456,35300,,,default,,0.48,cfp484_default,,,,,,,,,,,b,Q9U6Y3,O8SH6
m,10.1021/sb500237x,,,CreiLOV,,,MAGLRHTFVVADATLPDCPLVYASEGFYAMTGYGPDEVLGHNARFLQGEGTDPKEVQKIRDAIKKGEACSVRLLNYRKDGTPFWNLLTVTPIKTPDGRVSKFVGVQVDVTSKTEGKALA,creilov,6.38,495,450,12500,,,default,,0.51,creilov_default,,,,,,,,,,,b,,NENVO
wd,10.1038/nbt1066,,,CyPet,,,MVSKGEELFGGIVPILVELEGDVNGHKFSVSGEGEGDATYGKLTLKFICTTGKLPVPWPTLVTTLTWGVQCFSRYPDHMKQHDFFKSVMPEGYVQERTIFFKDDGNYKTRAEVKFEGDTLVNRIELKGIDFKEDGNILGHKLEYNYISHNVYITADKQKNGIKANFKARHNITDGSVQLADHYQQNTPIGDGPVILPDNHYLSTQSALSKDPNEKRDHMVLLEFVTAAGITHGMDELYK,cypet,17.85,477,435,35000,,,default,5.02,0.51,cypet_default,,,,,,,,,,,b,,V534T
,10.1038/nbt945,,,D10,,,MVSKGEELFTGVVPILVELDGDVNGHKFSVSGEGEGDATYGKLTLKFICTTGKLPVPWPTLVTTLTWGVQCFARYPDHMKQHDFFKSAMPEGYVQERTIFFKDDGNYKTRAEVKFEGDTLVNRIELKGIDFKEDGNILGHKLEYNGISDNVYITADKQKNGIKANFKIRHNIEDGSVQLADHYQQNTPIGDGPVLLPDNHYLSTQSALSKDPNEKRDHMVLLEFVTAAGITLGMDELYK,d10,20.24,475,433,44000,,,default,,0.46,d10_default,,,,,,,,,,,b,,GHBKT
t,10.1038/13657,AAF03370,200279,dsFP483,3CGL,,MSCSKSVIKEEMLIDLHLEGTFNGHYFEIKGKGKGQPNEGTNTVTLEVTKGGPLPFGWHILCPQFQYGNKAFVHHPDNIHDYLKLSFPEGYTWERSMHFEDGGLCCITNDISLTGNCFYYDIKFTGLNFPPNGPVVQKKTTGWEPSTERLYPRDGVLIGDIHHALTVEGGGHYACDIKTVYRAKKAALKMPGYHYVDTKLVIWNNDKEFMKVEEHEIAVARHHPFYEPKKDK,dsfp483,10.99,483,443,23900,,,default,,0.46,dsfp483_default,,,,,,,,,,,b,Q9U6Y7,YG5WM
,10.1016/j.cca.2004.07.002,AAU04444,3612525,DstC1,,,MSCSKNVIKEFMRFKVRMEGTVNGHEFEIEGEGEGRPYEGHNTVKLKVTKGGPLPFAWDILSPQFQYGSKVYVKHPADIPDYKKLSFPEGFKWERVMNFEDGGVVTVTQDSSLQDGCFIYKVKFIGVNFPSDGPVMQKKTMGWEASTERLYPRDGVLKGEIHKALKLKDGGHYLVEFKTIYMAKKPVQLPGYYYVDSKLDITSHNKDYTIVEQYERTEGRHHLFLKAELGSNVGER,dstc1,,482,436,,,,default,,,dstc1_default,,,,,,,,,,,b,Q66ND7,7J2M8
d,10.1042/bj20060874,,,dTFP0.1,,,MVSKGEETTMGVIKPDMKIKLKMEGNVNGHAFVIEGEGEGKPYDGTNTVNLEVKEGAPLPFSYDILSNAFQYGNRAFTKYPDDIADYFKQSFPEGYSWERTMTFEDKGIVKVKSDISMEEDSFIYEIRLKGKNFPPNGPVMQKKTLKWEPSTEILYVRDGVLVGDISHSLLLEGGGHYRCDFKTIYKAKKVVKLPDYHFVDHRIEILNHDKDYNKVTLYENAVARYSLLPSQAGMDELYK,dtfp01,26.46,485,456,42000,,,default,,0.63,dtfp01_default,,,,,,,,,,,b,,2BJM7
d,10.1042/bj20060874,ABG77396,5860095,dTFP0.2,,,MVSKGEETTMGVIKPDMKIKLKMEGNVNGHAFVIEGEGEGKPYDGTNTVNLEVKEGAPLPFSYDILSNAFQYGNRAFTKYPDDIANYFKQSFPEGYSWERTMTFEDKGIVKVKSDISMEEDSFIYEIRLKGKNFPPNGPVMQKKTLKWEPSTEILYVRDGVLVGDISHSLLLEGGGHYRCDFKTIYKAKKVVKLPDYHFVDHRIEILNHDKDYNKVTLYENAVARYSLLPPQAGMDELYK,dtfp02,40.8,486,456,60000,,,default,,0.68,dtfp02_default,,,,,,,,,,,b,,QQJHZ
wd,10.1074/jbc.273.14.8212,,,EBFP,,,MVSKGEELFTGVVPILVELDGDVNGHKFSVSGEGEGDATYGKLTLKFICTTGKLPVPWPTLVTTLTHGVQCFSRYPDHMKQHDFFKSAMPEGYVQERTIFFKDDGNYKTRAEVKFEGDTLVNRIELKGIDFKEDGNILGHKLEYNFNSHNVYIMADKQKNGIKVNFKIRHNIEDGSVQLADHYQQNTPIGDGPVLLPDNHYLSTQSALSKDPNEKRDHMVLLEFVTAAGITLGMDELYK,ebfp,6.3,440,380,31500,,,default,,0.2,ebfp_default,,,,,,,,,,,b,,1LZV9
m,10.1021/bi700199g,,,EBFP1.2,,,MVSKGEELFTGVVPILVELDGDVNGHKFSVRGEGEGDATNGKLTLKFICTTGKLPVPWPTLVTTLSHGVQCFARYPDHMKQHDFFKSAMPEGYVQERTIFFKDDGTYKTRAEVKFEGDTLVNRIELKGIDFKEDGNILGHKLEYNFNSHNVYIMADKQKNGIKVNFKIRHNVEDGSVQLADHYQQNTPIGDGPVLLPDSHYLSTQSVLSKDPNEKRDHMVLLEFVTAAGITLGMDELYK,ebfp12,18.45,446,379,41000,,,default,6.6,0.45,ebfp12_default,,,,,,,,,,,b,,514KE
m,10.1021/bi700199g,,,EBFP1.5,,,MVSKGEELFTGVVPILVELDGDVNGHKFSVRGEGEGDATNGKLTLKFICTTGKLPVPWPTLVTTLSHGVQCFARYPDHMKQHDFFKSAMPEGYVQERTIFFKDDGTYKTRAEVKFEGDTLVNRIELKGIDFKEDGNILGHKLEYNHNSNNVYIAADKQKNGIKVNFKIRHNVEDGSVQLADHYQQNTPIGDGPVLLPDSHYLSTQSVLSKDPNEKRDHMVLLEFVTAAGITLGMDELYK,ebfp15,22.79,449,381,43000,,,default,4.8,0.53,ebfp15_default,,,,,,,,,,,b,,XBGJO
m,10.1021/bi700199g,ABP88743,12966089,EBFP2,,,MVSKGEELFTGVVPILVELDGDVNGHKFSVRGEGEGDATNGKLTLKFICTTGKLPVPWPTLVTTLSHGVQCFARYPDHMKQHDFFKSAMPEGYVQERTIFFKDDGTYKTRAEVKFEGDTLVNRIELKGVDFKEDGNILGHKLEYNFNSHNIYIMAVKQKNGIKVNFKIRHNVEDGSVQLADHYQQNTPIGDGPVLLPDSHYLSTQSVLSKDPNEKRDHMVLLEFRTAAGITLGMDELYK,ebfp2,17.92,448,383,32000,3.0,25.0,default,5.3,0.56,ebfp2_default,,,,,,,,,,,b,,DVMQ7
m,10.1016/s0960-9822(02)00450-5,,,ECFP,5OX8,2WSN,MVSKGEELFTGVVPILVELDGDVNGHKFSVSGEGEGDATYGKLTLKFICTTGKLPVPWPTLVTTLTWGVQCFSRYPDHMKQHDFFKSAMPEGYVQERTIFFKDDGNYKTRAEVKFEGDTLVNRIELKGIDFKEDGNILGHKLEYNYISHNVYITADKQKNGIKANFKIRHNIEDGSVQLADHYQQNTPIGDGPVLLPDNHYLSTQSALSKDPNEKRDHMVLLEFVTAAGITLGMDELYK,ecfp,13.0,477,434,32500,3.0,,default,4.7,0.4,ecfp_default,,,,,,,,,,,b,,27HOS
,10.1038/nbt945,,,ECFP H148D,,,MVSKGEELFTGVVPILVELDGDVNGHKFSVSGEGEGDATYGKLTLKFICTTGKLPVPWPTLVTTLTWGVQCFSRYPDHMKQHDFFKSAMPEGYVQERTIFFKDDGNYKTRAEVKFEGDTLVNRIELKGIDFKEDGNILGHKLEYNYISDNVYITADKQKNGIKANFKIRHNIEDGSVQLADHYQQNTPIGDGPVLLPDNHYLSTQSALSKDPNEKRDHMVLLEFVTAAGITLGMDELYK,ecfp-h148d,2.18,475,433,3200,,,default,,0.68,ecfp-h148d_default,,,,,,,,,,,b,,D4OFQ
t,10.1371/journal.pone.0002680,ABB17970,4901480,efasCFP,,,MSFSKQVLNDVTMTYFMEGSVNGHDFTIEGEGTGKPYEGHQRFNLRVTKGAPLPFAVDILSAAFAYGNRCFTKYPKEIPDFFKQSLPEDMSWERTMTFEDGGIVAISAHIRLIGNRFEHKSKFVGVNFPADGPVMQRKTLGWEPSSEKMTPRDGILKGYVPSFLVLQGGGNYRCDYDTSYRAMKPVEMPGGHFIQHRIVRRDIKKDSNGNTWQIQEDAFAHNSEVPDSA,efascfp,31.06,490,466,40333,,,default,,0.77,efascfp_default,,,,,,,,,,,b,A8CLW9,OSFMK
m,10.1038/s41598-022-13214-0,OL631606,,Electra1,,,MVSKGEELIEENMRMKVVMEGSVNGHQFKCTGEGEGRPYEGVQTMRIKVIEGGPLPFAFDILATSFLFGSKTFIKYPADIPDFFKQSFPEGFTWERVTRYEDGGVVTVTQDTSLEDGGLVYNVKVRGVNFPSNGPVMQKKTEGWEPFTEMMYPANGGLRGYTDIALKVDGDGHLHANIVTTYRSKKTVGDIKMPGVHAVDYRLERVEESDNETYVVLREVAVAKYSNLGGGMDELYK,electra1,51.62,454,402,69750,3.4,,default,,0.74,electra1_default,,,,,,,,,,,b,,5X9A8
m,10.1038/s41598-022-13214-0,OL631607,,Electra2,,,MVSKGEELIEENMRMKVVMEGSVNGHQFKCTGEGEGRPYEGVQTMRIKVIEGGPLPFAFDILATSFLFGSKTFIKYPADIPDFFEQSFPEGFTWERVTRYEDGGVVTVTQDTSLEDGGLVYNVKVRGVNFHSKGPVMQKKTEGWEPFTEMMYPADGGLRGYTDIALKVDGGGHLHANIVTTYRSKKTVGNIKMPGVHAVDYRLERIEESDNETYVVLREVAVAKYSNLGGGMDELFK,electra2,61.48,454,403,80900,3.4,,default,,0.76,electra2_default,,,,,,,,,,,b,,5GJX3
,10.1016/s0896-6273(02)01099-1,,,Enhanced Cyan-Emitting GFP,1CV7,,MSKGEELFTGVVPILVELDGDVNGHRFSVSGEGEGDATYGKLTLKFICTTGKLPVPWPTLVTTLTWGVQCFSRYPDHMKQHDFFKSAMPEGYVQERTIFFKDDGNYKTRAEVKFEGDTLVNRIELKGIDFKEDGNILGHKLEYNYISHNVYITADKQKNGIKAHFKIRHNIEDGSVQLADHYQQNTPIGDGPVLLPDNHYLSTQSALSKDPNEKRDHMVLLEFVTAAG,enhanced-cyan-emitting-gfp,,485,458,,,,default,,,enhanced-cyan-emitting-gfp_default,,,,,,,,,,,b,,R3OET
t,10.1016/j.chembiol.2008.08.006,,,HcRed1-Blue,,,MAGLLKESMRIKMYMEGTVNGHYFKCEGEGDGNPFAGTQSMRIHVTEGAPLPFAFDILAPCCHYGSKTFVHHTAEIPDFWKQSFPEGFTWERTTTYEDGGILTAHQDTSLEGNCLIYKVKVHGTNFPADGPVMKNKSGGWEPITEVVYPENGVLCGRAVMALKVGDRHLICHAYTSYRSKKAVRALTMPGFHFTDYRLQMLRKKKDEYFELYEASVARYSDLPEKAN,hcred1-blue,,455,408,,,,default,,,hcred1-blue_default,,,,,,,,,,,b,,1ZQEX
m,10.1371/journal.pone.0095808,,,iq-EBFP2,,,,iq-ebfp2,15.62,446,386,24800,,,default,,0.63,iq-ebfp2_default,,,,,,,,,,,b,,QXJO4
m,10.1371/journal.pone.0095808,,,iq-mCerulean3,,,,iq-mcerulean3,25.12,474,433,27300,,,default,,0.92,iq-mcerulean3_default,,,,,,,,,,,b,,PX32J
d,10.1021/bi801658p,,,KCY,2ZO6,,MSVIKPEMKMKYFMDGSVNGHEFTVEGEGTGKPYEGKHKITLDVTKGGPLPFAFDLLSTVFSYGNRCLTKYPDDIPDYFKQCFPGGYSWERKFEFEDGGLAIAKAEISLKGNCFEHKSTIEGTFPDSSPIAQNKTLGWEPSTEKMTVRDGSMKGDDAAYLKLVGGGNHKCYFTTTYTAKKKIPNLPQSHFIGHRISSVVNGTKIGVMEDAIAHLYPFNGVPCQ,kcy,32.9,488,455,38700,,,default,,0.85,kcy_default,,,,,,,,,,,b,,2P4CB
,10.1021/bi801658p,,,KCY-G4219,,,MSVIKPEMKMRYRMDGSVNGHEFTVEGEGTGRPYEGKHKITLDVTKGGPLPFAFDLLSTVFSYGNRALTKYPDDIPDYFKQCFPGGYSWERKFEFEDGGLAIAKAEISLKGNCFEHKSTIEGTFPDSSPIMQNKTLGWEPSTEKMTVRDGSMKGDDAAYLKLVGGGNHKCYFTTTYTAKKKIPNLPKSHFIGHRISSVVEGTKIKVMEDAIAHLYPFNGSPCQ,kcy-g4219,16.88,486,453,21100,,,default,,0.8,kcy-g4219_default,,,,,,,,,,,b,,3KHK4
d,10.1021/bi801658p,,,KCY-R1,2ZO7,,DPTMVSVIKPEMKMRYYMDGSVNGHEFTVEGEGTGRPYEGKQKITLDVTKGGPLPFAFDLLSTVFSYGNRALTKYPDDIPDYFKQCFPGGYSWERKFEFEDGGLAIAKAEISLKGNCFEHKSTIEGTFPDSSPIMQNKTLGWEPSTEKMTVRDGSMKGDDASYLKLVGGGNHKCYFTTTYTAKKKIPNLPGSHFIGHRISSVVEGTKIKVMEDAIAHLYPFNGS,kcy-r1,15.9,492,461,21200,,,default,,0.75,kcy-r1_default,,,,,,,,,,,b,,437NM
,10.1021/bi801658p,,,KCY-R1-158A,,,DPTMVSVIKPEMKMRYYMDGSVNGHEFTVEGEGTGRPYEGKQKITLDVTKGGPLPFAFDLLSTVFSYGNRALTKYPDDIPDYFKQCFPGGYSWERKFEFEDGGLAIAKAEISLKGNCFEHKSTIEGTFPDSSPIMQNKTLGWEPSTEKMTVRDGSMKGDDAAYLKLVGGGNHKCYFTTTYTAKKKIPNLPGSHFIGHRISSVVEGTKIKVMEDAIAHLYPFNGS,kcy-r1-158a,,489,459,,,,default,,,kcy-r1-158a_default,,,,,,,,,,,b,,Z78XR
,10.1021/bi801658p,,,KCY-R1-38H,,,DPTMVSVIKPEMKMRYYMDGSVNGHEFTVEGEGTGRPYEGKHKITLDVTKGGPLPFAFDLLSTVFSYGNRALTKYPDDIPDYFKQCFPGGYSWERKFEFEDGGLAIAKAEISLKGNCFEHKSTIEGTFPDSSPIMQNKTLGWEPSTEKMTVRDGSMKGDDASYLKLVGGGNHKCYFTTTYTAKKKIPNLPGSHFIGHRISSVVEGTKIKVMEDAIAHLYPFNGS,kcy-r1-38h,,489,459,,,,default,,,kcy-r1-38h_default,,,,,,,,,,,b,,JWC7O
,10.1073/pnas.1424021112,,,Lumazine binding protein,,,MFRGIVQGRGVIRSISKSEDSQRHGIAFPEGMFQLVDVDTVMLVNGCSLTVVRILGDMVYFDIDQALGTTTFDGLKEGDQVNLEIHPKFGEVVGRGGLTGNIKGTALVAAIEENDAGFSVLIDIPKGLAENLTVKDDIGIDGISLPITDMSDSIITLNYSRDLLASTNIASLAKDVKVNVEILNEW,lumazine-binding-protein,,470,420,,13.6,,default,,0.55,lumazine-binding-protein_default,,,,,,,,,,,b,,6TP83
m,10.1021/bi700199g,,,mBlueberry1,,,MVSKGEEDNMAIIKEFMRFKVHMEGSVNGHEFEIEGEGEGRPYEGTQTAKLKVTKGGPLPFAWDILSPQFLFGSRAYVKHPADIPDYLKLSFPEGFKWERVMNFEDGGVVTVTQDSSLQDGEFIYKVKLRGTNFPSDGPVMRRKTMGWEASSERMCPEDGALKGEIKLRLKLRDGGHYDAEVKTTYKAKKPVQLPGAYNVNIKLDITSHNEDYTIVEQYERAEGRHSTGGMDELYK,mblueberry1,5.28,452,398,11000,,,default,,0.48,mblueberry1_default,,,,,,,,,,,b,,WNJAS
m,10.1021/bi700199g,,,mBlueberry2,,,MVSKGEENNVAIIKEFMRFKVHMEGSVNGHEFEIEGEGEGRPYEGTQTAKLKVTKGGPLPFAWDILSPQFLFGSKVYIKHPADIPDYFKLSFPEGFKWERVMNFEDGGVVTVTQDSSLQDGVFIYKVKLRGTNFPSDGPVMQKKTMGWEAFSERMYPEDGALKSEIKTRLKLKDGGHYDAEVKTTYKAKKPVQLPGAYNVNIKLDIVSHNEDYTIVEQYERAEGRHSTGGMDELYK,mblueberry2,24.48,467,402,51000,,,default,2.5,0.48,mblueberry2_default,,,,,,,,,,,b,,NYYN4
t,10.1016/j.febslet.2004.06.043,AAL17905,516570,mcCFP,,,MSVIKSVMKIKLRMDGIVNGHKFMITGEGEGKPFEGTHTIILKVKEGGPLPFAYDILTTAFQYGNRVFTKYPKDIPDYFKQSFPEGYSWERSMTFEDQGVCTVTSDIKLEGDCFFYEIRFYGVNFPSSGPVMQKKTLKWEPSTENMYVRDGVLLGDVSRTLLLEGDKHHRCNFRSTYGAKKGVVLPEYHFVDHRIEILSHDKDYNTVEVYENAVARPSMLPVKAK,mccfp,,477,432,,2.66,,default,,0.385,mccfp_default,,,,,,,,,,,b,Q95UA7,6N98Z
m,10.1529/biophysj.104.055442,,,mCerulean,,,MVSKGEELFTGVVPILVELDGDVNGHKFSVSGEGEGDATYGKLTLKFICTTGKLPVPWPTLVTTLTWGVQCFARYPDHMKQHDFFKSAMPEGYVQERTIFFKDDGNYKTRAEVKFEGDTLVNRIELKGIDFKEDGNILGHKLEYNAISDNVYITADKQKNGIKANFKIRHNIEDGSVQLADHYQQNTPIGDGPVLLPDNHYLSTQSKLSKDPNEKRDHMVLLEFVTAAGITLGMDELYK,mcerulean,16.17,475,433,33000,,6.6,default,,0.49,mcerulean_default,,,,,,,,,,,b,,J2JWA
m,10.1371/journal.pone.0017896,,,mCerulean2,,,MVSKGEELFTGVVPILVELDGDVNGHKFSVSGEGEGDATYGKLTLKFICTTGKLPVPWPTLVTTLTWGVQCFARYPDHMKQHDFFKSAMPEGYVQERTIFFKDDGNYKTRAEVKFEGDTLVNRIELKGIDFKEDGNILGHKLEYNAIHGNVYITADKQKNGIKANFGLNCNIEDGSVQLADHYQQNTPIGDGPVLLPDNHYLSTQSKLSKDPNEKRDHMVLLEFVTAAGITLGMDELYK,mcerulean2,28.2,474,432,47000,3.04,,default,4.8,0.6,mcerulean2_default,,,,,,,,,,,b,,UDAAK
m,10.1371/journal.pone.0017896,,,mCerulean2.D3,,,MVSKGEELFTGVVPILVELDGDVNGHKFSVSGEGEGDATYGKLTLKFICTTGKLPVPWPTLVTTLTWGVQCFARYPDHMKQHDFFKSAMPEGYVQERTIFFKDDGNYKTRAEVKFEGDTLVNRIELKGIDFKEDGNILGHKLEYNDFHGNVYITADKQKNGIKANFGLNCNIEDGSVQLADHYQQNTPIGDGPVLLPDNHYLSTQSKLSKDPNEKRDHMVLLEFVTAAGITLGMDELYK,mcerulean2d3,23.4,472,434,45000,,,default,,0.52,mcerulean2d3_default,,,,,,,,,,,b,,9KYTB
m,10.1371/journal.pone.0017896,,,mCerulean2.N,,,MVSKGEELFTGVVPILVELDGDVNGHKFSVSGEGEGDATYGKLTLKFICTTGKLPVPWPTLVTTLTWGVQCFARYPDHMKQHDFFKSAMPEGYVQERTIFFKDDGNYKTRAEVKFEGDTLVNRIELKGIDFKEDGNILGHKLEYNAIHGNVYITADKQKNGIKANFGLNCNIEDGSVQLADHYQQNTPIGDGPVLLPDNHYLSIQSKLSKDPNEKRDHMVLLEFVTAAGITLGMDELYK,mcerulean2n,23.52,484,440,49000,2.63,,default,4.5,0.48,mcerulean2n_default,,,,,,,,,,,b,,WQ6TU
m,10.1371/journal.pone.0017896,,,mCerulean2.N(T65S),,,MVSKGEELFTGVVPILVELDGDVNGHKFSVSGEGEGDATYGKLTLKFICTTGKLPVPWPTLVTTLSWGVQCFARYPDHMKQHDFFKSAMPEGYVQERTIFFKDDGNYKTRAEVKFEGDTLVNRIELKGIDFKEDGNILGHKLEYNAIHGNVYITADKQKNGIKANFGLNCNIEDGSVQLADHYQQNTPIGDGPVLLPDNHYLSIQSKLSKDPNEKRDHMVLLEFVTAAGITLGMDELYK,mcerulean2nt65s,19.78,481,439,43000,,,default,,0.46,mcerulean2nt65s_default,,,,,,,,,,,b,,EEJ9Q
m,10.1371/journal.pone.0017896,,,mCerulean3,4EN1,,MVSKGEELFTGVVPILVELDGDVNGHKFSVSGEGEGDATYGKLTLKFICTTGKLPVPWPTLVTTLSWGVQCFARYPDHMKQHDFFKSAMPEGYVQERTIFFKDDGNYKTRAEVKFEGDTLVNRIELKGIDFKEDGNILGHKLEYNAIHGNVYITADKQKNGIKANFGLNCNIEDGSVQLADHYQQNTPIGDGPVLLPDNHYLSTQSKLSKDPNEKRDHMVLLEFVTAAGITLGMDELYK,mcerulean3,34.8,475,433,40000,4.1,69.8,default,3.2,0.87,mcerulean3_default,,,,,,,,,,,b,,TWJXO
m,10.1371/journal.pone.0017896,,,mCerulean.B,,,MVSKGEELFTGVVPILVELDGDVNGHKFSVSGEGEGDATYGKLTLKFICTTGKLPVPWPTLVTTLTWGVQCFARYPDHMKQHDFFKSAMPEGYVQERTIFFKDDGNYKTRAEVKFEGDTLVNRIELKGIDFKEDGNILGHKLEYNAIGGNVYITADKQKNGIKANFKIRHNIEDGSVQLADHYQQNTPIGDGPVLLPDNHYLSTQSKLSKDPNEKRDHMVLLEFVTAAGITLGMDELYK,mceruleanb,21.07,473,434,43000,,,default,,0.49,mceruleanb_default,,,,,,,,,,,b,,ORBRD
m,10.1371/journal.pone.0017896,,,mCerulean.B2,,,MVSKGEELFTGVVPILVELDGDVNGHKFSVSGEGEGDATYGKLTLKFICTTGKLPVPWPTLVTTLTWGVQCFARYPDHMKQHDFFKSAMPEGYVQERTIFFKDDGNYKTRAEVKFEGDTLVNRIELKGIDFKEDGNILGHKLEYNAIGGNVYITADKQKNGIKANFGLRHNIEDGSVQLADHYQQNTPIGDGPVLLPDNHYLSTQSKLSKDPNEKRDHMVLLEFVTAAGITLGMDELYK,mceruleanb2,19.5,471,432,39000,,,default,,0.5,mceruleanb2_default,,,,,,,,,,,b,,9ALF8
m,10.1371/journal.pone.0017896,,,mCerulean.B24,,,MVSKGEELFTGVVPILVELDGDVNGHKFSVSGEGEGDATYGKLTLKFICTTGKLPVPWPTLVTTLTWGVQCFARYPDHMKQHDFFKSAMPEGYVQERTIFFKDDGNYKTRAEVKFEGDTLVNRIELKGIDFKEDGNILGHKLEYNAIHGNVYITADKQKNGIKANFGLRHNIEDGSVQLADHYQQNTPIGDGPVLLPDNHYLSTQSKLSKDPNEKRDHMVLLEFVTAAGITLGMDELYK,mceruleanb24,22.36,473,433,43000,,,default,,0.52,mceruleanb24_default,,,,,,,,,,,b,,243P7
m,10.1042/bj20060874,,,mECFP,,,MVSKGEELFTGVVPILVELDGDVNGHKFSVSGEGEGDATYGKLTLKFICTTGKLPVPWPTLVTTLTWGVQCFSRYPDHMKQHDFFKSAMPEGYVQERTIFFKDDGNYKTRAEVKFEGDTLVNRIELKGIDFKEDGNILGHKLEYNYISHNVYITADKQKNGIKANFKIRHNIEDGSVQLADHYQQNTPIGDGPVLLPDNHYLSTQSKLSKDPNEKRDHMVLLEFVTAAGITLGMDELYK,mecfp,13.53,475,433,33000,,,default,,0.41,mecfp_default,,,,,,,,,,,b,,MVN8T
t,10.1371/journal.pone.0002680,ABB17955,4901448,meleCFP,,,MSVIKTDMKIRLQMQGAVNGHPFVITGEGEGKPYEGKHTINLTVQDGGPLPFAFDILTTAFQYGNRVFTKYPKDIPDYFKQSFPAGYSWERCMTFEDGGLCTVSSHIKIEGDYFTYDIRFHGVNFPAGGPVMQKKTLRWEPSTENMYVRDGVLVGEVERTLLLEGNKHHRCNFRTTYKAKKEVVLPEYHFVDHRIEILGHDKDYNNVVVYENAVARQQASTLPSKAK,melecfp,35.08,485,454,47400,,,default,,0.74,melecfp_default,,,,,,,,,,,b,A8CLP7,KKQNA
m,10.1039/c6cc03119f,,,miniSOG Q103V,,,MEKSFVITDPRLPDNPIIFASDGFLELTEYSREEILGRNGRFLQGPETDQATVQKIRDAIRDQREITVQLINYTKSGKKFWNLLHLQPMRDQKGELQYFIGVVLDG,minisog-q103v,,487,440,,,,default,,0.43,minisog-q103v_default,,,,,,,,,,,b,,G4TXA
m,10.1021/bi700199g,ABP88742,12966091,mKalama1,,,MVSKGEELFTGVVPILVEMDGDVNGRKFSVRGVGEGDATHGKLTLKFICTSGKLPVPWPTLVTTLSYGVQCFSRYPDHMKQHDFFKSAMPEGYVQERTIFFKDDGSYKTRAEVKFEGDTLVNRIVLKGTDFKEDGNILGHKLEYNMNVGNVYITADKQKNGIKANFEIRHNVEDGGVQLADHYQQNTPIGDGSVLLPDNHYLSVQVKLSKDPNEKRDHMVLLEFRTAAGITPGMDELYK,mkalama1,16.2,456,385,36000,,,default,5.5,0.45,mkalama1_default,,,,,,,,,,,b,,TUONH
t,10.1371/journal.pone.0002680,ABB17965,4901536,mmilCFP,,,MALPKQMKLTYHMEGTVNGHFFIIKGEGGGEPYEGTHTIKLQVVEGSPLPFSPDILSTVFQYGNRCFTKYPPNIVDYFKNSCSGGGYTFGRSFLYEDGAVCTASGDITLSSDKSSFEHKSKFLGVNFPADGPVMKKETTNWEPSCEKMTPNGMTLIGDVTEFLLKKDGKRYKCQFHTFHDAKEKSRNMPMPDFHFVQHEIERKDLPGPMQTWQLTEHAAACKNCFTE,mmilcfp,38.25,492,404,42500,,,default,,0.9,mmilcfp_default,,,,,,,,,,,b,A8CLU7,QB1DP
m,10.1038/ncomms8670,,,moxBFP,,,MVSKGEELFTGVVPILVELDGDVNGHKFSVRGEGEGDATNGKLTLKFISTTGKLPVPWPTLVTTLSHGVQVFARYPDHMKQHDFFKSAMPEGYVQERTIFFKDDGTYKTRAEVKFEGDTLVNRIELKGVDFKEDGNILGHKLEYNFNSHNIYIMAVKQKNGIKANFKIRHNVEDGSVQLADHYQQNTPIGDGPVLLPDSHYLSTQSKLSKDPNEKRDHMVLLEFRTAAGITLGMDELYK,moxbfp,17.36,448,385,31000,,,default,,0.56,moxbfp_default,,,,,,,,,,,b,,SSTDU
m,10.1038/ncomms8670,,,moxCerulean3,,,MVSKGEELFTGVVPILVELDGDVNGHKFSVRGEGEGDATNGKLTLKFISTTGKLPVPWPTLVTTLSWGVQSFARYPDHMKQHDFFKSAMPEGYVQERTIFFKDDGTYKTRAEVKFEGDTLVNRIELKGIDFKEDGNILGHKLEYNAIHGNVYITADKQKNGIKANFGLNCNVEDGSVQLADHYQQNTPIGDGPVLLPDNHYLSTQSKLSKDPNEKRDHMVLLEFVTAAGITLGMDELYK,moxcerulean3,35.67,474,434,41000,,100.4,default,,0.87,moxcerulean3_default,,,,,,,,,,,b,,TPB93
m,10.1371/journal.pone.0028674,,,mTagBFP2,,,MVSKGEELIKENMHMKLYMEGTVDNHHFKCTSEGEGKPYEGTQTMRIKVVEGGPLPFAFDILATSFLYGSKTFINHTQGIPDFFKQSFPEGFTWERVTTYEDGGVLTATQDTSLQDGCLIYNVKIRGVNFTSNGPVMQKKTLGWEAFTETLYPADGGLEGRNDMALKLVGGSHLIANAKTTYRSKKPAKNLKMPGVYYVDYRLERIKEANNETYVEQHEVAVARYCDLPSKLGHKLN,mtagbfp2,32.38,454,399,50600,2.6,12.0,default,2.7,0.64,mtagbfp2_default,,,,,,,,,,,b,,ZO7NN
m,10.1042/bj20060874,,,mTFP0.3,,,MVSKGEETTMGVIKPDMKIKLKMEGNVNGHAFVIEGEGEGKPYDGTNTVNLEVKEGAPLPFSYDILSNAFQYGNRAFTKYPDDIANYFKQSFPEGYSWERTMTFEDKGIVKVKSDISMEEDSFIYEIRLKGKNFPPNGPVMQKKTLKWEPSTEILYVRDGVLVGDIKHKLLLEGGGHYRCDFKTIYKAKKVVKLPDYHFVDHRIEILNHDKDYNKVTLYENAVARYSLLPPQAGMDELYK,mtfp03,5.89,488,458,19000,,,default,,0.31,mtfp03_default,,,,,,,,,,,b,,8PKAY
m,10.1042/bj20060874,,,mTFP0.7,2OTE,2OTB,MVSKGEETTMGVIKPDMKIKLKMEGNVNGHAFVIEGEGEGKPYDGTNTINLEVKEGAPLPFSYDILTNAFAYGNRAFTKYPDDIPNYFKQSFPEGYSWERTMTFEDKGIVKVKSDISMEEDSFIYEIHLKGENFPPNGPVMQKKTLKWEPSTEILYVRDGVLVGDIKHKLLLEGGGHHRVDFKTIYRAKKAVKLPDYHFVDHRIEILNHDKDYNKVTVYESAVARYSTGGMDELYK,mtfp07,,,,,,,Off,,,mtfp07_off,30.0,488,453,60000,,,On,,0.5,mtfp07_on,o,,2HEJS
m,10.1042/bj20060874,ABG77397,5860107,mTFP1,2HQK,,MVSKGEETTMGVIKPDMKIKLKMEGNVNGHAFVIEGEGEGKPYDGTNTINLEVKEGAPLPFSYDILTTAFAYGNRAFTKYPDDIPNYFKQSFPEGYSWERTMTFEDKGIVKVKSDISMEEDSFIYEIHLKGENFPPNGPVMQKKTTGWDASTERMYVRDGVLKGDVKHKLLLEGGGHHRVDFKTIYRAKKAVKLPDYHFVDHRIEILNHDKDYNKVTVYESAVARNSTDGMDELYK,mtfp1,54.4,492,462,64000,3.2,,default,4.3,0.85,mtfp1_default,,,,,,,,,,,b,,ASSY9
m,10.1186/1741-7007-6-13,,,mTFP1-Y67W,,,MVSKGEETTMGVIKPDMKIKLKMEGNVNGHAFVIEGEGEGKPYDGTNTINLEVKEGAPLPFSYDILTTAFAWGNRAFTKYPDDIPNYFKQSFPEGYSWERTMTFEDKGIVKVKSDISMEEDSFIYEIHLKGENFPPNGPVMQKKTTGWDASTERMYVRDGVLKGDVKHKLLLEGGGHHRVDFKTIYRAKKAVKLPDYHFVDHRIEILNHDKDYNKVTVYESAVARNSTDGMDELYK,mtfp1-y67w,0.06,461,424,3000,,,default,,0.02,mtfp1-y67w_default,,,,,,,,,,,b,,4JYN3