agg,doi,genbank,ipg_id,name,pdb.0,seq,slug,states.0.brightness,states.0.em_max,states.0.ex_max,states.0.ext_coeff,states.0.lifetime,states.0.maturation,states.0.name,states.0.pka,states.0.qy,states.0.slug,switch_type,uniprot,uuid
wd,10.1074/jbc.273.14.8212,,,EBFP,,MVSKGEELFTGVVPILVELDGDVNGHKFSVSGEGEGDATYGKLTLKFICTTGKLPVPWPTLVTTLTHGVQCFSRYPDHMKQHDFFKSAMPEGYVQERTIFFKDDGNYKTRAEVKFEGDTLVNRIELKGIDFKEDGNILGHKLEYNFNSHNVYIMADKQKNGIKVNFKIRHNIEDGSVQLADHYQQNTPIGDGPVLLPDNHYLSTQSALSKDPNEKRDHMVLLEFVTAAGITLGMDELYK,ebfp,6.3,440,380,31500,,,default,,0.2,ebfp_default,b,,1LZV9
m,10.1016/j.chembiol.2018.08.008,MH062789,,mCarmine,,MVSKGEELIKENMHMKLYMEGTVNNHHFKCTSEGEGKPYEGTQTQRIKVVEGGPLPFAFDILATSFMYGSKTFINHTQGIPDFFKQSFPEGFTWERVTTYEDGGVLKVKQDTSLQDGCLIYNVKIRGVNFPSNGPVMQKKTLGWEANTETLYPADGGLRGYNTMALKLVGGGHLQTFLKTTYRSKKPAKNLKMPGVYFVDRRLERIKEADKETYVEQHEVAVARYCDLPSKLGHKLNGMDELYK,mcarmine,5.81,675,603,83000,,,default,5.58,0.07,mcarmine_default,b,,LG377
m,10.1038/nbt1037,AAV52164,3838123,mCherry,2H5Q,MVSKGEEDNMAIIKEFMRFKVHMEGSVNGHEFEIEGEGEGRPYEGTQTAKLKVTKGGPLPFAWDILSPQFMYGSKAYVKHPADIPDYLKLSFPEGFKWERVMNFEDGGVVTVTQDSSLQDGEFIYKVKLRGTNFPSDGPVMQKKTMGWEASSERMYPEDGALKGEIKQRLKLKDGGHYDAEVKTTYKAKKPVQLPGAYNVNIKLDITSHNEDYTIVEQYERAEGRHSTGGMDELYK,mcherry,15.84,610,587,72000,1.4,15.0,default,4.5,0.22,mcherry_default,b,X5DSL3,ZERB6
m,10.1126/science.1068539,,,mEGFP,,MVSKGEELFTGVVPILVELDGDVNGHKFSVSGEGEGDATYGKLTLKFICTTGKLPVPWPTLVTTLTYGVQCFSRYPDHMKQHDFFKSAMPEGYVQERTIFFKDDGNYKTRAEVKFEGDTLVNRIELKGIDFKEDGNILGHKLEYNYNSHNVYIMADKQKNGIKVNFKIRHNIEDGSVQLADHYQQNTPIGDGPVLLPDNHYLSTQSKLSKDPNEKRDHMVLLEFVTAAGITLGMDELYK,megfp,33.6,507,488,56000,,,default,6.0,0.6,megfp_default,b,,QKFJN
m,10.1073/pnas.1807449115,MK040729,,mGinger1,,MLLKENMHIKMYMEGTVNGHYFKCKGEGDGNPFAGTQSMRVHVTEGAPLPFAFDILAPCCEYGSKTFVRYPADIPDFFKQSFPEGFTWERTTTYEDGGILTAHQDTSLEGNCLIYKVKVHGTNFPADGPVMKKETCGWEPSTESVYPENGVLRGRNHMALKVGDSHLHCHHSTTYRSKKAERALIMPPRHSTDYCLQITSHKDDEYFELYETSVARYSD,mginger1,1.16,637,587,58000,,106.0,default,7.9,0.02,mginger1_default,b,,AQ2DU
m,10.1073/pnas.1807449115,MK040731,,mKelly1,,MELIKENMRMKLYMEGTVGNHHFKCTAEGEGKPYEGTQTQRIKVVEGGPLPFAFDILATCFMYGSKTFINHPQGIPDFFKQSFPEGFTWERVTTYEDGGVLTVTQDTSLQDGYLIYNVKLRGVNFPSNGPVMQKKTLGWEPTTETLVPVDGGLVGRCDMALRLVGGGHLKCNLKTTYRSKKPAKNLKMPGKYQVDRKLERIKEADNETYVEQHEVAVAR,mkelly1,7.04,656,596,44000,,28.0,default,5.4,0.16,mkelly1_default,b,,3PP3A
m,10.1038/nmeth.4074,APD76535,129830964,mScarlet,5LK4,MVSKGEAVIKEFMRFKVHMEGSMNGHEFEIEGEGEGRPYEGTQTAKLKVTKGGPLPFSWDILSPQFMYGSRAFTKHPADIPDYYKQSFPEGFKWERVMNFEDGGAVTVTQDTSLEDGTLIYKVKLRGTNFPPDGPVMQKKTMGWEASTERLYPEDGVLKGDIKMALRLKDGGRYLADFKTTYKAKKPVQMPGAYNVDRKLDITSHNEDYTVVEQYERSEGRHSTGGMDELYK,mscarlet,70.0,594,569,100000,3.9,174.0,default,5.3,0.7,mscarlet_default,b,,FVS3D
m,10.1038/ncomms1738,,,mTurquoise2,3ZTF,MVSKGEELFTGVVPILVELDGDVNGHKFSVSGEGEGDATYGKLTLKFICTTGKLPVPWPTLVTTLSWGVQCFARYPDHMKQHDFFKSAMPEGYVQERTIFFKDDGNYKTRAEVKFEGDTLVNRIELKGIDFKEDGNILGHKLEYNYFSDNVYITADKQKNGIKANFKIRHNIEDGGVQLADHYQQNTPIGDGPVLLPDNHYLSTQSKLSKDPNEKRDHMVLLEFVTAAGITLGMDELYK,mturquoise2,27.9,474,434,30000,4.0,33.5,default,3.1,0.93,mturquoise2_default,b,,7AV5G
