agg,doi,genbank,ipg_id,name,pdb.0,pdb.1,pdb.2,pdb.3,seq,slug,states.0.brightness,states.0.em_max,states.0.ex_max,states.0.ext_coeff,states.0.lifetime,states.0.maturation,states.0.name,states.0.pka,states.0.qy,states.0.slug,states.1.brightness,states.1.em_max,states.1.ex_max,states.1.ext_coeff,states.1.lifetime,states.1.maturation,states.1.name,states.1.pka,states.1.qy,states.1.slug,states.2.brightness,states.2.em_max,states.2.ex_max,states.2.ext_coeff,states.2.lifetime,states.2.maturation,states.2.name,states.2.pka,states.2.qy,states.2.slug,states.3.brightness,states.3.em_max,states.3.ex_max,states.3.ext_coeff,states.3.lifetime,states.3.maturation,states.3.name,states.3.pka,states.3.qy,states.3.slug,states.4.brightness,states.4.em_max,states.4.ex_max,states.4.ext_coeff,states.4.lifetime,states.4.maturation,states.4.name,states.4.pka,states.4.qy,states.4.slug,switch_type,uniprot,uuid
m,10.1039/c2mb25303h,,,Aquamarine,,,,,MVSKGEELFTGVVPILVELDGDVNGHKFSVSGEGEGDATYGKLTLKFICTTGKLPVPWPTLVTTLSWGVQCFSRYPDHMKQHDFFKSAMPEGYVQERTIFFKDDGNYKTRAEVKFEGDTLVNRIELKGIDFKEDGNILGHKLEYNYISGNVYITADKQKNGIKANFKIRHNIEDGSVQLADHYQQNTPIGDGPVLLPDNHYLSTQSALSKDPNEKRDHMVLLEFVTAAGITLGMDELYK,aquamarine,23.14,474,430,26000,4.1,,default,3.3,0.89,aquamarine_default,,,,,,,,,,,,,,,,,,,,,,,,,,,,,,,,,,,,,,,,,b,,963OH
m,10.1038/s41598-018-31687-w,,,BrUSLEE,,,,,MVSKGEELFTGVVPILVELDGDVNGHKFSVSGEGEGDATYGKLTLKFICTTGKLPVPWPTLVTTLGYGVQCFSRYPDHMKQHDFFKSAMPEGYVQERTIFFKDDGNYKTRAEVKFEGDTLVNRIELKGIDFKEDGNILGHKLEYNMNSHNVYIMADKQKNGIKVNYKIRHNIEDGSVQLADHYQQNTPIGDGPVLLPDNHYLSTQSALSKDPNEKRDHMVLLEFVTAAGITLGMDELYK,bruslee,25.8,509,487,86000,0.82,,default,,0.3,bruslee_default,,,,,,,,,,,,,,,,,,,,,,,,,,,,,,,,,,,,,,,,,b,,1K2R7
m,10.1038/nbt.3550,KU530233,,CyOFP1,,,,,MVSKGEELIKENMRSKLYLEGSVNGHQFKCTHEGEGKPYEGKQTNRIKVVEGGPLPFAFDILATHFMYGSKVFIKYPADLPDYFKQSFPEGFTWERVMVFEDGGVLTATQDTSLQDGELIYNVKVRGVNFPANGPVMQKKTLGWEPSTETMYPADGGLEGRCDKALKLVGGGHLHVNFKTTYKSKKPVKMPGVHYVDRRLERIKEADNETYVEQYEHAVARYSNLGGGMDELYK,cyofp1,30.4,589,497,40000,3.6,15.0,default,5.5,0.76,cyofp1_default,,,,,,,,,,,,,,,,,,,,,,,,,,,,,,,,,,,,,,,,,b,,TL112
m,10.1021/bi700199g,ABP88743,12966089,EBFP2,,,,,MVSKGEELFTGVVPILVELDGDVNGHKFSVRGEGEGDATNGKLTLKFICTTGKLPVPWPTLVTTLSHGVQCFARYPDHMKQHDFFKSAMPEGYVQERTIFFKDDGTYKTRAEVKFEGDTLVNRIELKGVDFKEDGNILGHKLEYNFNSHNIYIMAVKQKNGIKVNFKIRHNVEDGSVQLADHYQQNTPIGDGPVLLPDSHYLSTQSVLSKDPNEKRDHMVLLEFRTAAGITLGMDELYK,ebfp2,17.92,448,383,32000,3.0,25.0,default,5.3,0.56,ebfp2_default,,,,,,,,,,,,,,,,,,,,,,,,,,,,,,,,,,,,,,,,,b,,DVMQ7
m,10.1016/s0960-9822(02)00450-5,,,ECFP,5OX8,2WSN,,,MVSKGEELFTGVVPILVELDGDVNGHKFSVSGEGEGDATYGKLTLKFICTTGKLPVPWPTLVTTLTWGVQCFSRYPDHMKQHDFFKSAMPEGYVQERTIFFKDDGNYKTRAEVKFEGDTLVNRIELKGIDFKEDGNILGHKLEYNYISHNVYITADKQKNGIKANFKIRHNIEDGSVQLADHYQQNTPIGDGPVLLPDNHYLSTQSALSKDPNEKRDHMVLLEFVTAAGITLGMDELYK,ecfp,13.0,477,434,32500,3.0,,default,4.7,0.4,ecfp_default,,,,,,,,,,,,,,,,,,,,,,,,,,,,,,,,,,,,,,,,,b,,27HOS
m,10.1039/c8ib00103k,,,FR-1,,,,,MVSELIKENMPMKLYMEGTINNHHFKCTSEGEGKPYEGTQTMRIKVVEGGPPPFAFDILATSFMYGSRTFIKHPPGIPDFFKQSFPEGFTWERVTTYEDGGVLTATQDTSLQDGCLIYNVKVRGVNFPANGPVMQKKTLGWEASTETMYPADGGLEGACDMALKLVGGGHMICNLETTYRSKKPATNLKMPGVYNVDHRLERIKEADDETYVEQHEVAVARYSTGGAGDGGK,fr-1,28.87,594,569,84900,2.3,,default,,0.34,fr-1_default,,,,,,,,,,,,,,,,,,,,,,,,,,,,,,,,,,,,,,,,,b,,39D4R
m,10.1038/ncomms2208,,,FusionRed,,,,,MVSELIKENMPMKLYMEGTVNNHHFKCTSEGEGKPYEGTQTMRIKVVEGGPLPFAFDILATSFMYGSRTFIKHPPGIPDFFKQSFPEGFTWERVTTYEDGGVLTATQDTSLQDGCLIYNVKVRGVNFPANGPVMQKKTLGWEASTETMYPADGGLEGACDMALKLVGGGHLICNLETTYRSKKPATNLKMPGVYNVDHRLERIKEADDETYVEQHEVAVARYSTGGAGDGGK,fusionred,17.95,608,580,94500,1.8,130.0,default,4.6,0.19,fusionred_default,,,,,,,,,,,,,,,,,,,,,,,,,,,,,,,,,,,,,,,,,b,,S6A7A
m,10.1039/c8ib00103k,,,FusionRed-M,,,,,MVSELIKENMPMKLYMEGTVNNHHFKCTSEGEGKPYEGTQTMRIKVVEGGPLPFAFDILATSFMYGSRTFIKHPPGIPDFFKQSFPEGFTWERVTTYEDGGVLTATQDTSLQDGCLIYNVKVRGVNFPANGPVMQKKTLGWEASTETMYPADGGLEGACDMALKLVGGGHMICNLETTYRSKKPATNLKMPGVYNVDHRLERIKEADDETYVEQHEVAVARYSTGGAGDGGK,fusionred-m,24.17,594,571,71100,2.1,,default,,0.34,fusionred-m_default,,,,,,,,,,,,,,,,,,,,,,,,,,,,,,,,,,,,,,,,,b,,E3FDV
m,10.1021/acs.biochem.0c00484,,,FusionRed-MQV,,,,,MVSELIKENMPMKLYMEGTVNNHHFKCTSEGEGKPYEGTQTQRIKVVEGGPLPFAFDILATSFMYGSRTFIKHPPGIPDFFKQSFPEGFTWERVTTYEDGGVLTATQDTSLQDGCLIYNVKVRGVNFPANGPVMQKKTLGWEASTETMYPADGGLEGAVDMALKLVGGGHLICNMETTYRSKKPATNLKMPGVYNVDHRLERIKEADDETYVEQHEVAVARYSTGGAGDGGK,fusionred-mqv,76.32,585,566,144000,2.77,195.0,default,4.6,0.53,fusionred-mqv_default,,,,,,,,,,,,,,,,,,,,,,,,,,,,,,,,,,,,,,,,,b,,F35B7
m,10.1073/pnas.0914365107,,,LSS-mKate2,3NT3,,,,MSELIKENMHMKLYMEGTVNNHHFKCTSEGEGKPYEGTQTMRIKVVEGGPLPFAFDILATSFMYGSYTFINHTQGIPDFFKQSFPEGFTWERVTTYEDGGVLTATQDTSLQDGCLIYNVKIRGVNFTSNGPVMQKKTLGWEAGTEMLYPADGGLEGRSDDALKLVGGGHLICNLKSTYRSKKPAKNLKVPGVYYVDRRLERIKEADKETYVEQHEVAVARYCDLPSKLGHKLN,lss-mkate2,4.42,605,460,26000,1.4,150.0,default,2.7,0.17,lss-mkate2_default,,,,,,,,,,,,,,,,,,,,,,,,,,,,,,,,,,,,,,,,,b,,RU9EF
m,10.1038/nmeth.1209,ABC66097,,mApple,,,,,MVSKGEENNMAIIKEFMRFKVHMEGSVNGHEFEIEGEGEGRPYEAFQTAKLKVTKGGPLPFAWDILSPQFMYGSKVYIKHPADIPDYFKLSFPEGFRWERVMNFEDGGIIHVNQDSSLQDGVFIYKVKLRGTNFPSDGPVMQKKTMGWEASEERMYPEDGALKSEIKKRLKLKDGGHYAAEVKTTYKAKKPVQLPGAYIVDIKLDIVSHNEDYTIVEQYERAEGRHSTGGMDELYK,mapple,36.75,592,568,75000,2.9,30.0,default,6.5,0.49,mapple_default,,,,,,,,,,,,,,,,,,,,,,,,,,,,,,,,,,,,,,,,,b,,T5UGO
m,10.1371/journal.pone.0064849,,,mBeRFP,,,,,MVSKGEELIKENMHMKLYMEGTVNNHHFKCTSEGEGKPYEGTQTMRIKVVEGGPLPFAFDILATSFMYGSKTFINHTQGIPDFFKQSFPEGFTWERSTTYEDGGVLTATQDTSLQDGCLIYNVKIRGVNFPSNGPVMQKKTLGWEASTEMLYPADGGLEGRDYMALKLVGGGHLICNAKTTYRSKKPAKNLKMPGVYYVDRRLERIKEADKETSVEQHEVAVARYCDLPSKLGHK,mberfp,17.55,611,446,65000,2.0,60.0,default,5.6,0.27,mberfp_default,,,,,,,,,,,,,,,,,,,,,,,,,,,,,,,,,,,,,,,,,b,,2ERUG
m,10.1371/journal.pone.0017896,,,mCerulean2,,,,,MVSKGEELFTGVVPILVELDGDVNGHKFSVSGEGEGDATYGKLTLKFICTTGKLPVPWPTLVTTLTWGVQCFARYPDHMKQHDFFKSAMPEGYVQERTIFFKDDGNYKTRAEVKFEGDTLVNRIELKGIDFKEDGNILGHKLEYNAIHGNVYITADKQKNGIKANFGLNCNIEDGSVQLADHYQQNTPIGDGPVLLPDNHYLSTQSKLSKDPNEKRDHMVLLEFVTAAGITLGMDELYK,mcerulean2,28.2,474,432,47000,3.04,,default,4.8,0.6,mcerulean2_default,,,,,,,,,,,,,,,,,,,,,,,,,,,,,,,,,,,,,,,,,b,,UDAAK
m,10.1371/journal.pone.0017896,,,mCerulean2.N,,,,,MVSKGEELFTGVVPILVELDGDVNGHKFSVSGEGEGDATYGKLTLKFICTTGKLPVPWPTLVTTLTWGVQCFARYPDHMKQHDFFKSAMPEGYVQERTIFFKDDGNYKTRAEVKFEGDTLVNRIELKGIDFKEDGNILGHKLEYNAIHGNVYITADKQKNGIKANFGLNCNIEDGSVQLADHYQQNTPIGDGPVLLPDNHYLSIQSKLSKDPNEKRDHMVLLEFVTAAGITLGMDELYK,mcerulean2n,23.52,484,440,49000,2.63,,default,4.5,0.48,mcerulean2n_default,,,,,,,,,,,,,,,,,,,,,,,,,,,,,,,,,,,,,,,,,b,,WQ6TU
m,10.1371/journal.pone.0017896,,,mCerulean3,4EN1,,,,MVSKGEELFTGVVPILVELDGDVNGHKFSVSGEGEGDATYGKLTLKFICTTGKLPVPWPTLVTTLSWGVQCFARYPDHMKQHDFFKSAMPEGYVQERTIFFKDDGNYKTRAEVKFEGDTLVNRIELKGIDFKEDGNILGHKLEYNAIHGNVYITADKQKNGIKANFGLNCNIEDGSVQLADHYQQNTPIGDGPVLLPDNHYLSTQSKLSKDPNEKRDHMVLLEFVTAAGITLGMDELYK,mcerulean3,34.8,475,433,40000,4.1,69.8,default,3.2,0.87,mcerulean3_default,,,,,,,,,,,,,,,,,,,,,,,,,,,,,,,,,,,,,,,,,b,,TWJXO
m,10.1038/nbt1037,AAV52164,3838123,mCherry,2H5Q,,,,MVSKGEEDNMAIIKEFMRFKVHMEGSVNGHEFEIEGEGEGRPYEGTQTAKLKVTKGGPLPFAWDILSPQFMYGSKAYVKHPADIPDYLKLSFPEGFKWERVMNFEDGGVVTVTQDSSLQDGEFIYKVKLRGTNFPSDGPVMQKKTMGWEASSERMYPEDGALKGEIKQRLKLKDGGHYDAEVKTTYKAKKPVQLPGAYNVNIKLDITSHNEDYTIVEQYERAEGRHSTGGMDELYK,mcherry,15.84,610,587,72000,1.4,15.0,default,4.5,0.22,mcherry_default,,,,,,,,,,,,,,,,,,,,,,,,,,,,,,,,,,,,,,,,,b,X5DSL3,ZERB6
m,10.1038/srep20889,,,mClover3,,,,,MVSKGEELFTGVVPILVELDGDVNGHKFSVRGEGEGDATNGKLTLKFICTTGKLPVPWPTLVTTFGYGVACFSRYPDHMKQHDFFKSAMPEGYVQERTISFKDDGTYKTRAEVKFEGDTLVNRIELKGIDFKEDGNILGHKLEYNFNSHYVYITADKQKNCIKANFKIRHNVEDGSVQLADHYQQNTPIGDGPVLLPDNHYLSHQSKLSKDPNEKRDHMVLLEFVTAAGITHGMDELYK,mclover3,85.02,518,506,109000,3.11,43.5,default,6.5,0.78,mclover3_default,,,,,,,,,,,,,,,,,,,,,,,,,,,,,,,,,,,,,,,,,b,,RYFE4
m,10.1016/j.chembiol.2020.02.004,MN844880.1,,mCRISPRed,6XWY,,,,MVSKGEELIKENMRMKVVMEGSVNGHQFKCTGEGEGRPYEGVQTMRIKVIEGGPLPFAFDILATSFMYGSRTFIKYPADIPDFFKQSFPEGFTWERVTRYEDGGVVTVTQDTSLEDGELVYNVKVRGVNFPSNGPVMQKKTKGWEADTEMMYPADGGLRGYLDRALKVDGGGHLHCNFVTTYRSKKTVGDIKMPGVHAVDHRLERIEESDNETYVVQREVAVAKYSNLGGGMDELYK,mcrispred,13.11,592,460,28500,2.1,354.0,default,2.1,0.46,mcrispred_default,,,,,,,,,,,,,,,,,,,,,,,,,,,,,,,,,,,,,,,,,b,,RTMMX
m,10.1038/nmeth.4046,AOY07765,,mCyRFP1,,,,,MVSKGEELIKENMRSKLYLEGSVNGHQFKCTHEGEGKPYEGKQTARIKVVEGGPLPFAFDILATMFMYGSKVFIKYPADLPDYFKQSFPEGFTWERVMVFEDGGVLTATQDTSLQDGELIYNVKLRGVNFPANGPVMQKKTLGWEPSTETMYPADGGLEGRCDKKLKLVGGGHLHVNFKTTYKSKKPVKMPGVHYVDRRLERIKEADNETYVEQYEHAVARYSNLGGGMDELYK,mcyrfp1,17.55,594,528,27000,3.71,,default,5.6,0.65,mcyrfp1_default,,,,,,,,,,,,,,,,,,,,,,,,,,,,,,,,,,,,,,,,,b,,UQH8C
m,10.1016/j.chembiol.2011.08.007,,,mEosFP-M159A,,,,,MSAIKPDMKINLRMEGNVNGHHFVIDGDGTGKPFEGKQSMDLEVKEGGPLPFAFDILTTAFHYGNRVFVEYPDHIQDYFKQSFPKGYSWERSLTFEDGGICIARNDITMEGDTFYNKVRFHGTNFPANGPVMQKKTLKWEPSTEKMYVRDGVLTGDIHAALLLEGNAHYRCDFRTTYKAKEKGVKLPGYHLVDHCIEILSHDKDYNKVKLYEHAVAHSGLPDNARR,meosfp-m159a,51.27,514,487,98600,3.2,,Green,4.3,0.52,meosfp-m159a_green,,,,,,,,,,,,,,,,,,,,,,,,,,,,,,,,,,,,,,,,,b,,WBU2Y
m,10.1038/srep18006,,,mGarnet,,,,,MNSLIKENMRMKVVLEGSVNGHQFKCTGEGEGNPYMGTQTMRIKVIEGGPLPFAFDILATSFMYGSKTFIKYPKGIPDFFKQSFPEGFTWERVTRYEDGGVITVMQDTSLEDGCLVYHAQVRGVNFPSNGAVMQKKTKGWEPNTEMMYPADGGLRGYNHMALKVDGGGHLSCSLVTTYRSKKTVGNIKMPGIHAVDRRLERLEESDNEMFVVQREHAVAKFAGLGGG,mgarnet,8.55,670,598,95000,0.8,112.0,default,7.4,0.09,mgarnet_default,,,,,,,,,,,,,,,,,,,,,,,,,,,,,,,,,,,,,,,,,b,,AE8QV
m,10.1039/c6cc09081h,,,mGarnet2,,,,,MNSLIKENMRMKVVLEGSVNGHQFKCTGEGEGNPYMGTQTMRIKVIEGGPLPFAFDILATSFMYGSKTFIKYPKGIPDFFKQSFPEGFTWERVTRYEDGGVITVMQDTSLEDGCLVYHAQLRGVNFPSNGAVMQKKTKGWEPNTEMMYPADGGLRGYNHMALKVDGGGHLHCSLVTTYRSKKTVGNIKMPGIHAVDRRLERLEESDNEMFVVQREHAVAKFAGLGGG,mgarnet2,9.13,671,598,105000,0.76,,default,6.8,0.087,mgarnet2_default,,,,,,,,,,,,,,,,,,,,,,,,,,,,,,,,,,,,,,,,,b,,7DP3C
m,10.3389/fbioe.2022.1039317,,,miniGFP1,,,,,MEKSFVITDPWLPDYPIISASDGFLELTEYSREEIMGRNARFLQGPETDQATVQKIRDAIRDRRPTTVQLINYTKSGKKFWNLLHLQPVFDGKGGLQYFIGVQLVGSDHV,minigfp1,5.21,499,450,16800,4.46,,default,4.5,0.31,minigfp1_default,,,,,,,,,,,,,,,,,,,,,,,,,,,,,,,,,,,,,,,,,b,,OOLCX
m,10.1042/bj20081949,,,mKate2,,,,,MVSELIKENMHMKLYMEGTVNNHHFKCTSEGEGKPYEGTQTMRIKAVEGGPLPFAFDILATSFMYGSKTFINHTQGIPDFFKQSFPEGFTWERVTTYEDGGVLTATQDTSLQDGCLIYNVKIRGVNFPSNGPVMQKKTLGWEASTETLYPADGGLEGRADMALKLVGGGHLICNLKTTYRSKKPAKNLKMPGVYYVDRRLERIKEADKETYVEQHEVAVARYCDLPSKLGHR,mkate2,25.0,633,588,62500,2.5,20.0,default,5.4,0.4,mkate2_default,,,,,,,,,,,,,,,,,,,,,,,,,,,,,,,,,,,,,,,,,b,,DBBO8
m,10.1038/nbt1207,BAE93226,5593672,mKeima,2WHS,2WHU,2WHT,3IR8,MVSVIAKQMTYKVYMSGTVNGHYFEVEGDGKGKPYEGEQTVKLTVTKGGPLPFAWDILSPQLQYGSIPFTKYPEDIPDYFKQSFPEGYTWERSMNFEDGAVCTVSNDSSIQGNCFIYNVKISGENFPPNGPVMQKKTQGWEPSTERLFARDGMLIGNDYMALKLEGGGHYLCEFKSTYKAKKPVRMPGRHEIDRKLDVTSHNRDYTSVEQCEIAIARHSLLG,mkeima,,620,586,,,,pH5,6.5,,mkeima_ph5,,620,440,,,,pH6,6.5,,mkeima_ph6,,620,440,,,,pH8,6.5,,mkeima_ph8,,620,586,,,,pH4,6.5,,mkeima_ph4,3.46,620,440,14400,2.93,180.0,pH7.4,6.5,0.24,mkeima_ph74,b,Q1JV70,SXBT1
m,10.1042/bj20040321,BAD24722,3504947,mKO,3MGF,,,,MVSVIKPEMKMRYYMDGSVNGHEFTIEGEGTGRPYEGHQEMTLRVTMAKGGPMPFAFDLVSHVFCYGHRPFTKYPEEIPDYFKQAFPEGLSWERSLEFEDGGSASVSAHISLRGNTFYHKSKFTGVNFPADGPIMQNQSVDWEPSTEKITASDGVLKGDVTMYLKLEGGGNHKCQFKTTYKAAKKILKMPGSHYISHRLVRKTEGNITELVEDAVAHS,mko,30.96,559,548,51600,4.1,,default,5.0,0.6,mko_default,,,,,,,,,,,,,,,,,,,,,,,,,,,,,,,,,,,,,,,,,b,Q6I7B2,RR1M4
m,10.1038/nmeth.2413,AGG56535,34051755,mNeonGreen,5LTP,5LTR,,,MVSKGEEDNMASLPATHELHIFGSINGVDFDMVGQGTGNPNDGYEELNLKSTKGDLQFSPWILVPHIGYGFHQYLPYPDGMSPFQAAMVDGSGYQVHRTMQFEDGASLTVNYRYTYEGSHIKGEAQVKGTGFPADGPVMTNSLTAADWCRSKKTYPNDKTIISTFKWSYTTGNGKRYRSTARTTYTFAKPMAANYLKNQPMYVFRKTELKHSKTELNFKEWQKAFTDVMGMDELYK,mneongreen,92.8,517,506,116000,3.1,10.0,default,5.7,0.8,mneongreen_default,,,,,,,,,,,,,,,,,,,,,,,,,,,,,,,,,,,,,,,,,b,,ZRKRV
m,10.1038/nmeth.1209,ABC66096,5194148,mOrange2,,,,,MVSKGEENNMAIIKEFMRFKVRMEGSVNGHEFEIEGEGEGRPYEGFQTAKLKVTKGGPLPFAWDILSPHFTYGSKAYVKHPADIPDYFKLSFPEGFKWERVMNYEDGGVVTVTQDSSLQDGEFIYKVKLRGTNFPSDGPVMQKKTMGWEASSERMYPEDGALKGKIKMRLKLKDGGHYTSEVKTTYKAKKPVQLPGAYIVDIKLDITSHNEDYTIVEQYERAEGRHSTGGMDELYK,morange2,34.8,565,549,58000,2.7,270.0,default,6.5,0.6,morange2_default,,,,,,,,,,,,,,,,,,,,,,,,,,,,,,,,,,,,,,,,,b,,5GR1V
m,10.1371/journal.pone.0004391,,,mRuby,3U0M,3U0L,3U0N,,MNSLIKENMRMKVVLEGSVNGHQFKCTGEGEGNPYMGTQTMRIKVIEGGPLPFAFDILATSFMYGSRTFIKYPKGIPDFFKQSFPEGFTWERVTRYEDGGVITVMQDTSLEDGCLVYHAQVRGVNFPSNGAVMQKKTKGWEPNTEMMYPADGGLRGYTHMALKVDGGGHLSCSFVTTYRSKKTVGNIKMPGIHAVDHRLERLEESDNEMFVVQREHAVAKFAGLGGG,mruby,39.2,605,558,112000,2.6,168.0,default,4.4,0.35,mruby_default,,,,,,,,,,,,,,,,,,,,,,,,,,,,,,,,,,,,,,,,,b,,6KLAW
m,10.1038/nmeth.2171,AFR60232,30275455,mRuby2,,,,,MVSKGEELIKENMRMKVVMEGSVNGHQFKCTGEGEGNPYMGTQTMRIKVIEGGPLPFAFDILATSFMYGSRTFIKYPKGIPDFFKQSFPEGFTWERVTRYEDGGVVTVMQDTSLEDGCLVYHVQVRGVNFPSNGPVMQKKTKGWEPNTEMMYPADGGLRGYTHMALKVDGGGHLSCSFVTTYRSKKTVGNIKMPGIHAVDHRLERLEESDNEMFVVQREHAVAKFAGLGGGMDELYK,mruby2,42.94,600,559,113000,2.5,150.0,default,5.3,0.38,mruby2_default,,,,,,,,,,,,,,,,,,,,,,,,,,,,,,,,,,,,,,,,,b,,8MJ78
m,10.1038/nmeth.4074,APD76535,129830964,mScarlet,5LK4,,,,MVSKGEAVIKEFMRFKVHMEGSMNGHEFEIEGEGEGRPYEGTQTAKLKVTKGGPLPFSWDILSPQFMYGSRAFTKHPADIPDYYKQSFPEGFKWERVMNFEDGGAVTVTQDTSLEDGTLIYKVKLRGTNFPPDGPVMQKKTMGWEASTERLYPEDGVLKGDIKMALRLKDGGRYLADFKTTYKAKKPVQMPGAYNVDRKLDITSHNEDYTVVEQYERSEGRHSTGGMDELYK,mscarlet,70.0,594,569,100000,3.9,174.0,default,5.3,0.7,mscarlet_default,,,,,,,,,,,,,,,,,,,,,,,,,,,,,,,,,,,,,,,,,b,,FVS3D
m,10.1038/nmeth.4074,APD76537,129830966,mScarlet-H,,,,,MVSKGEAVIKEFMRFKVHMEGSMNGHEFEIEGEGEGRPYEGTQTAKLKVTKGGPLPFSWDILSPQFMYGSRAFTKHPADIPDYYKQSFPEGFKWERVMNFEDGGAVTVTQDTSLEDGTLIYKVKLRGTNFPPDGPVMQKKTMGWEASTERLYPEDGVLKGDIKHALRLKDGGRYLADFKTTYKAKKPVQMPGAYNVDRKLDITSHNEDYTVVEQYERSEGRHSTGGMDELYK,mscarlet-h,14.8,592,551,74000,1.3,264.0,default,4.8,0.2,mscarlet-h_default,,,,,,,,,,,,,,,,,,,,,,,,,,,,,,,,,,,,,,,,,b,,588N2
m,10.1038/nmeth.4074,APD76536,129830965,mScarlet-I,,,,,MVSKGEAVIKEFMRFKVHMEGSMNGHEFEIEGEGEGRPYEGTQTAKLKVTKGGPLPFSWDILSPQFMYGSRAFIKHPADIPDYYKQSFPEGFKWERVMNFEDGGAVTVTQDTSLEDGTLIYKVKLRGTNFPPDGPVMQKKTMGWEASTERLYPEDGVLKGDIKMALRLKDGGRYLADFKTTYKAKKPVQMPGAYNVDRKLDITSHNEDYTVVEQYERSEGRHSTGGMDELYK,mscarlet-i,56.16,593,569,104000,3.1,36.0,default,5.4,0.54,mscarlet-i_default,,,,,,,,,,,,,,,,,,,,,,,,,,,,,,,,,,,,,,,,,b,,6VVTK
m,10.1371/journal.pone.0028674,,,mTagBFP2,,,,,MVSKGEELIKENMHMKLYMEGTVDNHHFKCTSEGEGKPYEGTQTMRIKVVEGGPLPFAFDILATSFLYGSKTFINHTQGIPDFFKQSFPEGFTWERVTTYEDGGVLTATQDTSLQDGCLIYNVKIRGVNFTSNGPVMQKKTLGWEAFTETLYPADGGLEGRNDMALKLVGGSHLIANAKTTYRSKKPAKNLKMPGVYYVDYRLERIKEANNETYVEQHEVAVARYCDLPSKLGHKLN,mtagbfp2,32.38,454,399,50600,2.6,12.0,default,2.7,0.64,mtagbfp2_default,,,,,,,,,,,,,,,,,,,,,,,,,,,,,,,,,,,,,,,,,b,,ZO7NN
m,10.1042/bj20060874,ABG77397,5860107,mTFP1,2HQK,,,,MVSKGEETTMGVIKPDMKIKLKMEGNVNGHAFVIEGEGEGKPYDGTNTINLEVKEGAPLPFSYDILTTAFAYGNRAFTKYPDDIPNYFKQSFPEGYSWERTMTFEDKGIVKVKSDISMEEDSFIYEIHLKGENFPPNGPVMQKKTTGWDASTERMYVRDGVLKGDVKHKLLLEGGGHHRVDFKTIYRAKKAVKLPDYHFVDHRIEILNHDKDYNKVTVYESAVARNSTDGMDELYK,mtfp1,54.4,492,462,64000,3.2,,default,4.3,0.85,mtfp1_default,,,,,,,,,,,,,,,,,,,,,,,,,,,,,,,,,,,,,,,,,b,,ASSY9
m,10.1038/nmeth.1415,,,mTurquoise,4AR7,,,,MVSKGEELFTGVVPILVELDGDVNGHKFSVSGEGEGDATYGKLTLKFICTTGKLPVPWPTLVTTLSWGVQCFARYPDHMKQHDFFKSAMPEGYVQERTIFFKDDGNYKTRAEVKFEGDTLVNRIELKGIDFKEDGNILGHKLEYNYISDNVYITADKQKNGIKANFKIRHNIEDGGVQLADHYQQNTPIGDGPVLLPDNHYLSTQSKLSKDPNEKRDHMVLLEFVTAAGITLGMDELYK,mturquoise,25.2,474,434,30000,3.7,112.2,default,4.5,0.84,mturquoise_default,,,,,,,,,,,,,,,,,,,,,,,,,,,,,,,,,,,,,,,,,b,,5E826
m,10.1038/ncomms1738,,,mTurquoise2,3ZTF,,,,MVSKGEELFTGVVPILVELDGDVNGHKFSVSGEGEGDATYGKLTLKFICTTGKLPVPWPTLVTTLSWGVQCFARYPDHMKQHDFFKSAMPEGYVQERTIFFKDDGNYKTRAEVKFEGDTLVNRIELKGIDFKEDGNILGHKLEYNYFSDNVYITADKQKNGIKANFKIRHNIEDGGVQLADHYQQNTPIGDGPVLLPDNHYLSTQSKLSKDPNEKRDHMVLLEFVTAAGITLGMDELYK,mturquoise2,27.9,474,434,30000,4.0,33.5,default,3.1,0.93,mturquoise2_default,,,,,,,,,,,,,,,,,,,,,,,,,,,,,,,,,,,,,,,,,b,,7AV5G
m,10.1021/bi0516273,AAZ65844,4596892,mVenus,,,,,MVSKGEELFTGVVPILVELDGDVNGHKFSVSGEGEGDATYGKLTLKLICTTGKLPVPWPTLVTTLGYGLQCFARYPDHMKQHDFFKSAMPEGYVQERTIFFKDDGNYKTRAEVKFEGDTLVNRIELKGIDFKEDGNILGHKLEYNYNSHNVYITADKQKNGIKANFKIRHNIEDGGVQLADHYQQNTPIGDGPVLLPDNHYLSYQSKLSKDPNEKRDHMVLLEFVTAAGITLGMDELYK,mvenus,66.56,527,515,104000,2.7,17.6,default,5.5,0.64,mvenus_default,,,,,,,,,,,,,,,,,,,,,,,,,,,,,,,,,,,,,,,,,b,,WCSN6
m,10.1016/j.bpj.2015.06.018,,,NowGFP,4rtc,4rys,4ryw,,MVSKGEKLFTGVVPILVELDGDVNGHKFSVSGEGEGDATYGKMSLKFICTTGKLPVPWPTLKTTLTWGMQCFARYPDHMKQHDFFKSAMPEGYVQERTIFFKDDGNYKTRAEVKFEGDTLVNRIELKGVDFKEDGNILGHKLEYNAISGNANITADKQKNGIKAYFTIRHDVEDGSVLLADHYQQNTPIGDGPVLLPDNHYLSTQSKQSKDPNEKRDHMVLLEFVTAAGIPLGADELYK,nowgfp,43.09,502,494,56700,5.1,,default,6.2,0.76,nowgfp_default,,,,,,,,,,,,,,,,,,,,,,,,,,,,,,,,,,,,,,,,,b,,HXP5A
m,10.1021/bi0516273,AAZ65846,4596891,SCFP1,,,,,MVSKGEELFTGVVPILVELDGDVNGHKFSVSGEGEGDATYGKLTLKFICTTGKLPVPWPTLVTTLTWGLQCFARYPDHMKQHDFFKSAMPEGYVQERTIFFKDDGNYKTRAEVKFEGDTLVNRIELKGIDFKEDGNILGHKLEYNYISHNVYITADKQKNGIKANFKIRHNIEDGGVQLADHYQQNTPIGDGPVLLPDNHYLSTQSKLSKDPNEKRDHMVLLEFVTAAGITLGMDELYK,scfp1,6.96,477,434,29000,1.5,50.9,default,3.5,0.24,scfp1_default,,,,,,,,,,,,,,,,,,,,,,,,,,,,,,,,,,,,,,,,,b,,5NY15
m,10.1021/bi0516273,AAZ65848,4596895,SCFP3A,2YDZ,,,,MVSKGEELFTGVVPILVELDGDVNGHKFSVSGEGEGDATYGKLTLKFICTTGKLPVPWPTLVTTLTWGVQCFARYPDHMKQHDFFKSAMPEGYVQERTIFFKDDGNYKTRAEVKFEGDTLVNRIELKGIDFKEDGNILGHKLEYNYISDNVYITADKQKNGIKANFKIRHNIEDGGVQLADHYQQNTPIGDGPVLLPDNHYLSTQSKLSKDPNEKRDHMVLLEFVTAAGITLGMDELYK,scfp3a,16.8,474,433,30000,2.6,6.4,default,4.5,0.56,scfp3a_default,,,,,,,,,,,,,,,,,,,,,,,,,,,,,,,,,,,,,,,,,b,,HFE84
m,10.1021/bi0516273,AAZ65849,4596888,SCFP3B,,,,,MVSKGEELFTGVVPILVELDGDVNGHKFSVSGEGEGDATYGKLTLKFICTTGKLPVPWPTLVTTLTWGVQCFARYPDHMKQHDFFKSAMPEGYVQERTIFFKDDGNYKTRAEVKFEGDTLVNRIELKGIDFKEDGNILGHKLEYNAISDNVYITADKQKNGIKANFKIRHNIEDGGVQLADHYQQNTPIGDGPVLLPDNHYLSTQSKLSKDPNEKRDHMVLLEFVTAAGITLGMDELYK,scfp3b,15.0,474,433,30000,2.3,,default,4.5,0.5,scfp3b_default,,,,,,,,,,,,,,,,,,,,,,,,,,,,,,,,,,,,,,,,,b,,YVJ5E
m,10.1021/ja400098b,,,SHardonnay,3V3D,,,,MVSKGEELFTGVVPILVELDGDVNGHKFSVSGEGEGDATYGKLTLKFICTTGKLPVPWPTLVTTFGYGLQCFARYPDHMKQHDFFKSAMPEGYVQERTIFFKDDGNYKTRAEVKFEGDTLVNRIELKGIDFKEDGNILGHKLEYNYNSHNVYIMADKQKNGIKVNFKIRHNIEDGSVQLADHYQQNTPIGDGPVLLPDNHYLSFQSALSKDPNEKRDHMVLLEFVTAAGITLGMDELYK,shardonnay,66.75,530,511,89000,3.4,,default,,0.75,shardonnay_default,,,,,,,,,,,,,,,,,,,,,,,,,,,,,,,,,,,,,,,,,b,,6VP2A
m,10.1038/s41467-018-07246-2,AYH52606,212327017,SNIFP,,,,,MSRDPLPFFPPLYLGGPEITTENCEREPIHIPGSIQPHGALLTADGHSGEVLQMSLNAATFLGQEPTVLRGQTLAALLPEQWPALQAALPPGCPDALQYRATLDWPAAGHLSLTVHRVGELLILEFEPTEAWDSTGPHALRNAMSALESAPNLRALAEVATQTVRELTGFDRVMLYKFAPDATGEVIAEARREGLHAFLGHRFPASLIPAQARALYTRHLLRLTADTRAAAVPLDPVLNPQTNAPTPLGGAVLRATSPMHMQFLRNMGVRSSLSVSVVVGGQLWGLIACHHQTPYVLPPDLRTTLEYLGRELSEQVQVKE,snifp,3.28,720,697,149200,0.63,,default,,0.022,snifp_default,,,,,,,,,,,,,,,,,,,,,,,,,,,,,,,,,,,,,,,,,b,,Q5F5J
m,10.1021/bi0516273,DQ092361,,SYFP2,,,,,MVSKGEELFTGVVPILVELDGDVNGHKFSVSGEGEGDATYGKLTLKLICTTGKLPVPWPTLVTTLGYGVQCFARYPDHMKQHDFFKSAMPEGYVQERTIFFKDDGNYKTRAEVKFEGDTLVNRIELKGIDFKEDGNILGHKLEYNYNSHNVYITADKQKNGIKANFKIRHNIEDGGVQLADHYQQNTPIGDGPVLLPDNHYLSYQSKLSKDPNEKRDHMVLLEFVTAAGITLGMDELYK,syfp2,68.68,527,515,101000,2.9,4.1,default,6.0,0.68,syfp2_default,,,,,,,,,,,,,,,,,,,,,,,,,,,,,,,,,,,,,,,,,b,,GB9EO
m,10.1016/j.chembiol.2008.08.006,,,TagBFP,3M24,,,,MSELIKENMHMKLYMEGTVDNHHFKCTSEGEGKPYEGTQTMRIKVVEGGPLPFAFDILATSFLYGSKTFINHTQGIPDFFKQSFPEGFTWERVTTYEDGGVLTATQDTSLQDGCLIYNVKIRGVNFTSNGPVMQKKTLGWEAFTETLYPADGGLEGRNDMALKLVGGSHLIANIKTTYRSKKPAKNLKMPGVYYVDYRLERIKEANNETYVEQHEVAVARYCDLPSKLGHKLN,tagbfp,32.76,457,402,52000,2.6,13.0,default,2.7,0.63,tagbfp_default,,,,,,,,,,,,,,,,,,,,,,,,,,,,,,,,,,,,,,,,,b,,BFJKS
m,10.1038/srep01847,,,TagRFP675,4KGE,4KGF,,,MSELIKENMHMKLYMEGTVNNHHFKCTSEGEGKPYEGTQTQRIKVVEGGPLPFAFDILATSFMYGSKTFINHTQGIPDFWKQSFPEGFTWERVTTYEDGGVLTATQDTSLQDGCLIYNVKIRGVNFPSNGPVMQKKTLGWEANTEMMYPADGGLEGRNYMALKLVGGGHLICSLKTTYRSKKPAKNLKMPGVYYVDRRLERIKEADKETYVEQHEVAVARYCDLPSKLGHKLN,tagrfp675,3.68,675,598,46000,0.9,25.0,default,5.7,0.08,tagrfp675_default,,,,,,,,,,,,,,,,,,,,,,,,,,,,,,,,,,,,,,,,,b,,NLF4R
m,10.1038/nmeth.1209,ACD03281,,TagRFP-T,5JVA,,,,MVSKGEELIKENMHMKLYMEGTVNNHHFKCTSEGEGKPYEGTQTMRIKVVEGGPLPFAFDILATSFMYGSRTFINHTQGIPDFFKQSFPEGFTWERVTTYEDGGVLTATQDTSLQDGCLIYNVKIRGVNFPSNGPVMQKKTLGWEANTEMLYPADGGLEGRTDMALKLVGGGHLICNFKTTYRSKKPAKNLKMPGVYYVDHRLERIKEADKETYVEQHEVAVARYCDLPSKLGHKLNGMDELYK,tagrfp-t,33.21,584,555,81000,2.3,100.0,default,4.6,0.41,tagrfp-t_default,,,,,,,,,,,,,,,,,,,,,,,,,,,,,,,,,,,,,,,,,b,,LF3LJ
m,10.1038/nmeth.1415,,,Turquoise-GL,2YE1,,,,MVSKGEELFTGVVPILVELDGDVNGHKFSVSGEGEGDATYGKLTLKFICTTGKLPVPWPTLVTTLSWGVQCFARYPDHMKQHDFFKSAMPEGYVQERTIFFKDDGNYKTRAEVKFEGDTLVNRIELKGIDFKEDGNILGHKLEYNYISGNVYITADKQKNGIKANFKIRHNIEDGGVQLADHYQQNTPIGDGPVLLPDNHYLSTQSALSKDPNEKRDHMVLLEFLTAAGITLGMDELYK,turquoise-gl,24.6,474,434,30000,3.9,,default,,0.82,turquoise-gl_default,,,,,,,,,,,,,,,,,,,,,,,,,,,,,,,,,,,,,,,,,b,,KBERH
m,10.1371/journal.pone.0041028,,,Ultramarine,,,,,MSVIATQMTYKVYMSGTVNGHYFEVEGDGKGRPYEGEQTAKLTVTKGGPLPFAWDILSPQCQYGSIPFTKYPEDIPDYVKQSFPEGFTWERIMNFEDGAVCTVSNDSSIQGNCFTYHVKFRGTNFPPNGPVMQKKTQGWEPNSERLFARGGMLIGNNRMALKLEGGGHYLCEFKTTYKAKKPVKMPGYHYVDRKLDVTNHNKDYTSVEQCEISIARKPVVA,ultramarine,0.06,626,586,64000,1.6,108.0,default,,0.001,ultramarine_default,,,,,,,,,,,,,,,,,,,,,,,,,,,,,,,,,,,,,,,,,b,,3F18R
