agg,doi,genbank,ipg_id,name,pdb.0,seq,slug,states.0.brightness,states.0.em_max,states.0.ex_max,states.0.ext_coeff,states.0.lifetime,states.0.maturation,states.0.name,states.0.pka,states.0.qy,states.0.slug,states.1.brightness,states.1.em_max,states.1.ex_max,states.1.ext_coeff,states.1.lifetime,states.1.maturation,states.1.name,states.1.pka,states.1.qy,states.1.slug,switch_type,transitions.0.from_state,transitions.0.to_state,transitions.0.trans_wave,uniprot,uuid
,10.1021/acs.jafc.9b05473,,,BR1,,MIEKNYVITDPRLPDNPIIFASDGFLELTGYSREEILGRNARFLQGPETDQATVQKIRDAIRDQRETTVQLINYTKSGRKFWNLLHLQPVRDQKGELQYFIGVQLDGSDRV,br1,5.62,495,450,12500,,,BR1,,0.45,br1_br1,,,,,,,,,,,b,,,,,WH633
,10.1073/pnas.0807551105,AII99665,61191410,iLov,,MIEKNFVITDPRLPDNPIIFASDGFLELTEYSREEILGRNARFLQGPETDQATVQKIRDAIRDQRETTVQLINYTKSGKKFWNLLHLQPVRDQKGELQYFIGVQLDGSDHVSGGGGSDYKDDDDK,ilov,,497,447,,,,default,,0.44,ilov_default,,,,,,,Dark,,,ilov_dark,o,ilov_default,ilov_dark,476,,CE7VU
,10.1021/acs.jafc.0c00121,,,KOFP-7,,MSPMINAKLLQLMVEYSNDGIVVAEPEGNESILIYVNPAFERLTGYCADDILYQDGRFLQGEDHDQPGIAIIREAIREGRPCCQVLRNYRKDGSLFWNELSITPVHNEADRLTYFIGTQRDVTAQVFAEERMRELEAEVAELRRQ,kofp-7,,496,450,,,,KOFP-7,,0.61,sang-taek-jung_kofp-7,,,,,,,,,,,b,,,,,25HRD
m,10.1371/journal.pbio.1001041,,,miniSOG,6GPU,MEKSFVITDPRLPDNPIIFASDGFLELTEYSREEILGRNGRFLQGPETDQATVQKIRDAIRDQREITVQLINYTKSGKKFWNLLHLQPMRDQKGELQYFIGVQLDG,minisog,6.06,501,447,14100,,,default,,0.43,minisog_default,,,,,,,,,,,b,,,,,ZZHSE
,10.1016/j.chembiol.2016.12.010,,,miniSOG2,,MEKSFVITDPRLPDNPIIFASDSFLELTEYSREEILGRNPRFLRGPETDQATVQKIHDAIRDQREITVQLINYTKSGKKFWNLFRLQPIRDQKGELQYFIGVQLDG,minisog2,,507,429,,,,default,,,minisog2_default,,,,,,,,,,,b,,,,,8EDYL
m,10.1039/c6cc03119f,,,miniSOG Q103V,,MEKSFVITDPRLPDNPIIFASDGFLELTEYSREEILGRNGRFLQGPETDQATVQKIRDAIRDQREITVQLINYTKSGKKFWNLLHLQPMRDQKGELQYFIGVVLDG,minisog-q103v,,487,440,,,,default,,0.43,minisog-q103v_default,,,,,,,,,,,b,,,,,G4TXA
m,10.1002/pro.4261,MZ682637,,phiLOV3,,MEKSFVITDPRLPDYPIIFASDGFLELTEYSREEIMGRNARFLQGPETDQATVQKIRDAIRDRRETTVQLINYTKSGKKFWNLLHLQPVRDGKGGLQYFIGVQLVGSDHV,philov3,3.48,502,452,15800,,,default,3.3,0.22,philov3_default,,,,,,,,,,,b,,,,,PG1ZQ
d,10.1039/c3pp50414j,SKB92435.1,AEV23113.1,Pp2 FbFP,,MINAKLLQLMVEHSNDGIVVAEQEGNESILIYVNPAFERLTGYCADDILYQDARFLQGEDHDQPGIAIIREAIREGRPCCQVLRNYRKDGSLFWNELSITPVHNEADQLTYYIGIQRDVTAQVFAEERVRELEAEVAELRRQQGQAKH,pp2-fbfp,3.12,495,449,14200,,,default,,0.22,pp2-fbfp_default,,,,,,,,,,,b,,,,Q88JB0,4BUSQ
d,10.1039/c4pp00338a,,,Pp2FbFP L30M,,MINAKLLQLMVEHSNDGIVVAEQEGNESIMIYVNPAFERLTGYCADDILYQDARFLQGEDHDQPGIAIIREAIREGRPCCQVLRNYRKDGSLFWNELSITPVHNEADQLTYYIGIQRDVTAQVFAEERVRELEAEVAELRRQQGQAKH,pp2fbfp-l30m,3.7,495,449,14800,,,default,,0.25,pp2fbfp-l30m_default,,,,,,,,,,,b,,,,,WN1JX
,10.1021/acs.jafc.9b05473,,,SH3,,MIEKNYVITDPRLPDNPIIFASDGFLELTEYSREEILGRNARFLQGPETDQATVQKIRDAIRDQRETTVQLINYTKSGKEFWNLFHLQPVRNQKGELQYFIGVQQDGSDHV,sh3,,495,450,,,,SH3,,0.4,sh3_sh3,,,,,,,,,,,b,,,,,PFYNU
,10.1021/ja511940j,,,SOPP,,MEKSFVITDPRLPDNPIIFASDGFLELTEYSREEILGRNGRFLQGPETDQATVQKIRDAIRDQREITVQLINYTKSGKKFWNLLHLQPMRDQKGELQYFIGVLLDG,sopp,5.66,487,440,14500,,,default,,0.39,sopp_default,,,,,,,,,,,b,,,,,VVQ8D
,10.1021/acs.jpcb.7b07831,,,SOPP2,,MEKSFVITDPRLPDNPIIFASDGFLELTEYSREEILGRNGRFLQGPETDQATVQKIRDAIRDQREITVQLINYTKSGKKFLNLLHLQPMRDQKGELQYFIGVVLDG,sopp2,6.07,491,439,14800,,,default,,0.41,sopp2_default,,,,,,,,,,,b,,,,,DVDZZ
,10.1021/acs.jpcb.7b07831,,,SOPP3,,MEKSFVITDPRLPDNPIIFASDGFLELTEYSREEILGRNGRFLQGPETDQATVQKIRDAIRDQREITVQLINYTKSGKKFLNLLNLQPIRDQKGELQAFIGVVLDG,sopp3,6.15,490,439,15000,,,default,,0.41,sopp3_default,,,,,,,,,,,b,,,,,W4PW7
