agg,doi,genbank,ipg_id,name,pdb.0,pdb.1,pdb.2,seq,slug,states.0.brightness,states.0.em_max,states.0.ex_max,states.0.ext_coeff,states.0.lifetime,states.0.maturation,states.0.name,states.0.pka,states.0.qy,states.0.slug,switch_type,uniprot,uuid
m,10.1371/journal.pone.0037551,,,cfSGFP2,,,,MVSKGEELFTGVVPILVELDGDVNGHKFSVSGEGEGDATYGKLTLKFISTTGKLPVPWPTLVTTLTYGVQMFARYPDHMKQHDFFKSAMPEGYVQERTIFFKDDGNYKTRAEVKFEGDTLVNRIELKGIDFKEDGNILGHKLEYNYNSHNVYITADKQKNGIKANFKIRHNIEDGGVQLADHYQQNTPIGDGPVLLPDNHYLSTQSKLSKDPNEKRDHMVLLEFVTAAGITLGMDELYK,cfsgfp2,33.75,517,493,45000,,,default,5.4,0.75,cfsgfp2_default,b,,YAH6C
m,10.1038/nbt.3550,KU530233,,CyOFP1,,,,MVSKGEELIKENMRSKLYLEGSVNGHQFKCTHEGEGKPYEGKQTNRIKVVEGGPLPFAFDILATHFMYGSKVFIKYPADLPDYFKQSFPEGFTWERVMVFEDGGVLTATQDTSLQDGELIYNVKVRGVNFPANGPVMQKKTLGWEPSTETMYPADGGLEGRCDKALKLVGGGHLHVNFKTTYKSKKPVKMPGVHYVDRRLERIKEADNETYVEQYEHAVARYSNLGGGMDELYK,cyofp1,30.4,589,497,40000,3.6,15.0,default,5.5,0.76,cyofp1_default,b,,TL112
m,10.1186/1741-7007-6-13,,,G3,,,,MVSKGEETTMGVIKPDMKIKLKMEGNVNGHAFVIEGEGEGKPYDGTNTINLEVKEGAPLPFSYDILTTAFAYGNRAFAKYPDDIPNYFKQSFPEGYSWERTMTFEDKGIVKVKSDISMEEDSFIYEIHLKGENFPPNGPVMQKMTTGWDASTERMYVRDGVLKGDVKMKLLLEGGGHHRVDFKTIYRAKKAVKLPDYHFVDHRIEILNHDKDYNKVTVYESAVARNSTDGMDELYK,g3,34.3,515,498,49000,,,default,,0.7,g3_default,b,,FM76L
m,10.1371/journal.pone.0095808,,,iq-mEmerald,,,,MVSKGEELFTGVVPILVELDGDVNGHKFSVSGEGEGDATYGKLTLKFICTTGKLPVPWPTLVTTLTYGVQCFARYPDHMKQHDFFKSAMPEGYVQERTIFFKDDGNYKTRAEVKFEGDTLVNRIELKGIDFKEDGNILGHKLEYNYNHHKVYITADKQKNGIKVNFKTRHNIEDGSVQLADHYQQNTPIGDGPVLLPDNHYLHTHSKLSKDPNEKRDHMVLLEFVTAAGITLGMDELYK,iq-memerald,33.77,509,482,50400,,,default,,0.67,iq-memerald_default,b,,7G47U
m,10.1371/journal.pone.0095808,,,iq-mVenus,,,,,iq-mvenus,55.88,529,516,88700,,,default,,0.63,iq-mvenus_default,b,,H9KU1
m,10.1074/jbc.m304063200,BAD52002,3705442,mAzamiGreen,3ADF,,,MSVIKPEMKIKLCMRGTVNGHNFVIEGEGKGNPYEGTQILDLNVTEGAPLPFAYDILTTVFQYGNRAFTKYPADIQDYFKQTFPEGYHWERSMTYEDQGICTATSNISMRGDCFFYDIRFDGTNFPPNGPVMQKKTLKWEPSTEKMYVRDGVLKGDVNMALLLEGGGHYRCDFKTTYKAKKDVRLPDAHKVDHRIEILKHDKDYNKVKLYENAVARYSMLPSQAK,mazamigreen,33.86,505,492,41800,,,default,6.2,0.81,mazamigreen_default,b,Q60I24,QRBKZ
m,10.1126/science.1068539,,,mCitrine,,,,MVSKGEELFTGVVPILVELDGDVNGHKFSVSGEGEGDATYGKLTLKFICTTGKLPVPWPTLVTTFGYGLMCFARYPDHMKQHDFFKSAMPEGYVQERTIFFKDDGNYKTRAEVKFEGDTLVNRIELKGIDFKEDGNILGHKLEYNYNSHNVYIMADKQKNGIKVNFKIRHNIEDGSVQLADHYQQNTPIGDGPVLLPDNHYLSYQSKLSKDPNEKRDHMVLLEFVTAAGITLGMDELYK,mcitrine,69.56,529,516,94000,,,default,,0.74,mcitrine_default,b,,3Q37R
m,10.1038/srep20889,,,mClover3,,,,MVSKGEELFTGVVPILVELDGDVNGHKFSVRGEGEGDATNGKLTLKFICTTGKLPVPWPTLVTTFGYGVACFSRYPDHMKQHDFFKSAMPEGYVQERTISFKDDGTYKTRAEVKFEGDTLVNRIELKGIDFKEDGNILGHKLEYNFNSHYVYITADKQKNCIKANFKIRHNVEDGSVQLADHYQQNTPIGDGPVLLPDNHYLSHQSKLSKDPNEKRDHMVLLEFVTAAGITHGMDELYK,mclover3,85.02,518,506,109000,3.11,43.5,default,6.5,0.78,mclover3_default,b,,RYFE4
m,10.1126/science.1068539,,,mEGFP,,,,MVSKGEELFTGVVPILVELDGDVNGHKFSVSGEGEGDATYGKLTLKFICTTGKLPVPWPTLVTTLTYGVQCFSRYPDHMKQHDFFKSAMPEGYVQERTIFFKDDGNYKTRAEVKFEGDTLVNRIELKGIDFKEDGNILGHKLEYNYNSHNVYIMADKQKNGIKVNFKIRHNIEDGSVQLADHYQQNTPIGDGPVLLPDNHYLSTQSKLSKDPNEKRDHMVLLEFVTAAGITLGMDELYK,megfp,33.6,507,488,56000,,,default,6.0,0.6,megfp_default,b,,QKFJN
m,10.1126/sciadv.abb7438,,,mGold,,,,MVSKGEELFTGVVPILVELDGDVNGHKFSVSGEGEGDATYGKLTLKFICTTGKLPVPWPTLVTSLGYGLQCFARYPDHMKQHDFFKSAMPEGYVQERTIFFKDDGNYKTRAEVKFEGDTLVNRIELKGIDFKEDGNILGHKLEYNYNSHNVYITADKQKNGIKANFKIRHNIEDGGVQLADHYQQNTPIGDGPVLLPDNHYLSYQSKLSKDPNEKRDHMVLLEFVTAAGITLGMDELYK,mgold,68.48,531,515,107000,,,default,5.9,0.64,mgold_default,b,,UNETX
m,10.1042/bj20040321,BAD24722,3504947,mKO,3MGF,,,MVSVIKPEMKMRYYMDGSVNGHEFTIEGEGTGRPYEGHQEMTLRVTMAKGGPMPFAFDLVSHVFCYGHRPFTKYPEEIPDYFKQAFPEGLSWERSLEFEDGGSASVSAHISLRGNTFYHKSKFTGVNFPADGPIMQNQSVDWEPSTEKITASDGVLKGDVTMYLKLEGGGNHKCQFKTTYKAAKKILKMPGSHYISHRLVRKTEGNITELVEDAVAHS,mko,30.96,559,548,51600,4.1,,default,5.0,0.6,mko_default,b,Q6I7B2,RR1M4
m,10.1016/j.cell.2007.12.033,BAG06989,14335281,mKO2,,,,MVSVIKPEMKMRYYMDGSVNGHEFTIEGEGTGRPYEGHQEMTLRVTMAEGGPMPFAFDLVSHVFCYGHRVFTKYPEEIPDYFKQAFPEGLSWERSLEFEDGGSASVSAHISLRGNTFYHKSKFTGVNFPADGPIMQNQSVDWEPSTEKITASDGVLKGDVTMYLKLEGGGNHKCQMKTTYKAAKEILEMPGDHYIGHRLVRKTEGNITEQVEDAVAHS,mko2,39.56,565,551,63800,,108.0,default,5.5,0.62,mko2_default,b,,134NN
m,10.1038/nmeth.2413,AGG56535,34051755,mNeonGreen,5LTP,5LTR,,MVSKGEEDNMASLPATHELHIFGSINGVDFDMVGQGTGNPNDGYEELNLKSTKGDLQFSPWILVPHIGYGFHQYLPYPDGMSPFQAAMVDGSGYQVHRTMQFEDGASLTVNYRYTYEGSHIKGEAQVKGTGFPADGPVMTNSLTAADWCRSKKTYPNDKTIISTFKWSYTTGNGKRYRSTARTTYTFAKPMAANYLKNQPMYVFRKTELKHSKTELNFKEWQKAFTDVMGMDELYK,mneongreen,92.8,517,506,116000,3.1,10.0,default,5.7,0.8,mneongreen_default,b,,ZRKRV
m,10.1038/nbt1037,AAV52165,3838262,mOrange,2H5O,,,MVSKGEENNMAIIKEFMRFKVRMEGSVNGHEFEIEGEGEGRPYEGFQTAKLKVTKGGPLPFAWDILSPQFTYGSKAYVKHPADIPDYFKLSFPEGFKWERVMNFEDGGVVTVTQDSSLQDGEFIYKVKLRGTNFPSDGPVMQKKTMGWEASSERMYPEDGALKGEIKMRLKLKDGGHYTSEVKTTYKAKKPVQLPGAYIVGIKLDITSHNEDYTIVEQYERAEGRHSTGGMDELYK,morange,48.99,562,548,71000,,150.0,default,6.5,0.69,morange_default,b,,G6HDH
m,10.1038/nmeth.1209,ABC66096,5194148,mOrange2,,,,MVSKGEENNMAIIKEFMRFKVRMEGSVNGHEFEIEGEGEGRPYEGFQTAKLKVTKGGPLPFAWDILSPHFTYGSKAYVKHPADIPDYFKLSFPEGFKWERVMNYEDGGVVTVTQDSSLQDGEFIYKVKLRGTNFPSDGPVMQKKTMGWEASSERMYPEDGALKGKIKMRLKLKDGGHYTSEVKTTYKAKKPVQLPGAYIVDIKLDITSHNEDYTIVEQYERAEGRHSTGGMDELYK,morange2,34.8,565,549,58000,2.7,270.0,default,6.5,0.6,morange2_default,b,,5GR1V
m,10.1038/ncomms8670,,,moxGFP,,,,MVSKGEELFTGVVPILVELDGDVNGHKFSVRGEGEGDATNGKLTLKFISTTGKLPVPWPTLVTTLTYGVQSFSRYPDHMKRHDFFKSAMPEGYVQERTISFKDDGTYKTRAEVKFEGDTLVNRIELKGIDFKEDGNILGHKLEYNFNSHNVYITADKQKNGIKANFKIRHNVEDGSVQLADHYQQNTPIGDGPVLLPDNHYLSTQSKLSKDPNEKRDHMVLLEFVTAAGITHGMDELYK,moxgfp,50.46,510,486,87000,,17.1,default,,0.58,moxgfp_default,b,,H99SX
m,10.1038/ncomms8670,,,moxNeonGreen,,,,MVSKGEEDNMASLPATHELHIFGSINGVDFDMVGQGTGNPNDGYEELNLKSTKGDLQFSPWILVPHIGYGFHQYLPYPDGMSPFQAAMVDGSGYQVHRTMQFEDGASLTVNYRYTYEGSHIKGEAQVKGTGFPADGPVMTNSLTAADWSRSKKTYPNDKTIISTFKWSYTTGNGKRYRSTARTTYTFAKPMAANYLKNQPMYVFRKTELKHSKTELNFKEWQKAFTDVMGMDELYK,moxneongreen,82.14,520,505,111000,,,default,,0.74,moxneongreen_default,b,,GSCT9
m,10.1038/ncomms8670,,,moxVenus,,,,MVSKGEELFTGVVPILVELDGDVNGHKFSVRGEGEGDATNGKLTLKLISTTGKLPVPWPTLVTTLGYGLQSFARYPDHMKQHDFFKSAMPEGYVQERTIFFKDDGTYKTRAEVKFEGDTLVNRIELKGIDFKEDGNILGHKLEYNFNSHNVYITADKQKNGIKANFKIRHNVEDGGVQLADHYQQNTPIGDGPVLLPDNHYLSYQSKLSKDPNEKRDHMVLKEFVTAAGITLGMDELYK,moxvenus,43.61,526,514,89000,,25.8,default,,0.49,moxvenus_default,b,,2KWB9
m,10.1016/j.chembiol.2013.08.008,AGX93076,44320375,mPapaya,,,,MVSKGEGQSKHGLKEEMTVKYHMEGCVNGHKFVITGEGIGNPFKGKQTANLCVIEGGPLPFSEDILSPGFKYGDRIFTEYPQDIVDYFKNSCPAGYTWERSYLFEDGAVCRCNVDITVSEKENCIYHKSIFRGVNFPADGPVMKKMTTNWEASTEKIVPVPKQGILKGKVKMCLLLKDGGRYHCQFDTVYKAKSVPSKMPEWHFIQHKLLREDRSDAKNQKWQLTEHAIAGMDELYK,mpapaya,35.69,541,530,43000,,,default,6.8,0.83,mpapaya_default,b,,5LCAQ
m,10.1038/nmeth.4074,APD76535,129830964,mScarlet,5LK4,,,MVSKGEAVIKEFMRFKVHMEGSMNGHEFEIEGEGEGRPYEGTQTAKLKVTKGGPLPFSWDILSPQFMYGSRAFTKHPADIPDYYKQSFPEGFKWERVMNFEDGGAVTVTQDTSLEDGTLIYKVKLRGTNFPPDGPVMQKKTMGWEASTERLYPEDGVLKGDIKMALRLKDGGRYLADFKTTYKAKKPVQMPGAYNVDRKLDITSHNEDYTVVEQYERSEGRHSTGGMDELYK,mscarlet,70.0,594,569,100000,3.9,174.0,default,5.3,0.7,mscarlet_default,b,,FVS3D
m,10.1038/nmeth.1235,,,mUkG,,,,MSVIKEEMKIKLHMEGNVNGHAFVIEGDGKGKPYDGTQTLNLTVKEGAPLPFSYDILTNAFQYGNRAFTKYPADIPDYFKQTFPEGYSWERTMSYEDNAICNVRSEISMEGDCFIYKIRFDGKNFPPNGPVMQKKTLKWEPSTEMMYVRDGFLMGDVNMALLLEGGGHHRCDFKTSYKAKKVVQLPDAHKIDHRIEILSHDRDYSKVKLYENAVARNSLLPSQA,mukg,43.2,499,483,60000,,,default,5.2,0.72,mukg_default,b,,BXYZE
m,10.1021/bi0516273,AAZ65844,4596892,mVenus,,,,MVSKGEELFTGVVPILVELDGDVNGHKFSVSGEGEGDATYGKLTLKLICTTGKLPVPWPTLVTTLGYGLQCFARYPDHMKQHDFFKSAMPEGYVQERTIFFKDDGNYKTRAEVKFEGDTLVNRIELKGIDFKEDGNILGHKLEYNYNSHNVYITADKQKNGIKANFKIRHNIEDGGVQLADHYQQNTPIGDGPVLLPDNHYLSYQSKLSKDPNEKRDHMVLLEFVTAAGITLGMDELYK,mvenus,66.56,527,515,104000,2.7,17.6,default,5.5,0.64,mvenus_default,b,,WCSN6
m,10.1111/j.1742-4658.2010.07618.x,,,mVFP,,,,MNVIKPDMRIKLRMEGAVNGHKFVILGDGNGKPYEGTQTIDVTVKEGGPLPFAYDILTSAFQYGNRVFTKYPDDIADYFKQSFPVGYSWERSMTYEDGGICTVSSDIKMEGNSFIYEIRFHGLNFPSDGPVMQKKTVKWEPSTEKMYVRDGVLKGDVNMRLLLEGGGHYRCDFKSTYKAKRAVQLPDYHYIDHRIEILSHDKDYNKVKLCENAAARCSMLPSQAK,mvfp,73.1,503,491,85000,,,default,,0.86,mvfp_default,b,,GUFES
m,10.1111/j.1742-4658.2010.07618.x,,,mVFP1,,,,MNVIKPDMRIKLRMEGAVNGHKFVILGDGNGKPYEGTQTIDVTVKEGGPLPFAYDILTSAFQYGNRVFTKYPDDIADYFKQSFPVGYSWERSMTYEDGGICTVSSDIKMEGNSFIYEIRFHGLNFPSDGPVMQKKTVKWEPSTEKMYVRDGVLKGDVKMTLLLEGGGHYRCDFKSTYKAKRAVQLPDYHYIDHRIEILSHDKDYNKVKLCENAAARCSMLPSQAK,mvfp1,67.54,503,491,80400,,,default,,0.84,mvfp1_default,b,,LXWLT
m,10.1186/1741-7007-6-13,ABW74902.1,,mWasabi,,,,MVSKGEETTMGVIKPDMKIKLKMEGNVNGHAFVIEGEGEGKPYDGTNTINLEVKEGAPLPFSYDILTTAFSYGNRAFTKYPDDIPNYFKQSFPEGYSWERTMTFEDKGIVKVKSDISMEEDSFIYEIHLKGENFPPNGPVMQKETTGWDASTERMYVRDGVLKGDVKMKLLLEGGGHHRVDFKTIYRAKKAVKLPDYHFVDHRIEILNHDKDYNKVTVYEIAVARNSTDGMDELYK,mwasabi,56.0,509,493,70000,,,default,6.5,0.8,mwasabi_default,b,,QTBVW
m,10.1016/j.bpj.2015.06.018,,,NowGFP,4rtc,4rys,4ryw,MVSKGEKLFTGVVPILVELDGDVNGHKFSVSGEGEGDATYGKMSLKFICTTGKLPVPWPTLKTTLTWGMQCFARYPDHMKQHDFFKSAMPEGYVQERTIFFKDDGNYKTRAEVKFEGDTLVNRIELKGVDFKEDGNILGHKLEYNAISGNANITADKQKNGIKAYFTIRHDVEDGSVLLADHYQQNTPIGDGPVLLPDNHYLSTQSKQSKDPNEKRDHMVLLEFVTAAGIPLGADELYK,nowgfp,43.09,502,494,56700,5.1,,default,6.2,0.76,nowgfp_default,b,,HXP5A
m,10.1093/molbev/msh079,AAQ01184,1715614,ppluGFP2,2G3O,,,MPAMKIECRITGTLNGVEFELVGGGEGTPEQGRMTNKMKSTKGALTFSPYLLSHVMGYGFYHFGTYPSGYENPFLHAINNGGYTNTRIEKYEDGGVLHVSFSYRYEAGRVIGDFKVVGTGFPEDSVIFTDKIIRSNATVEHLHPMGDNVLVGSFARTFSLRDGGYYSFVVDSHMHFKSAIHPSILQNGGPMFAFRRVEELHSNTELGIVEYQHAFKTPIAFA,pplugfp2,42.0,502,482,70000,,,default,,0.6,pplugfp2_default,b,Q6WV12,2BK6M
m,10.1021/bi0622874,ABM97852,6755366,SGFP2,,,,MVSKGEELFTGVVPILVELDGDVNGHKFSVSGEGEGDATYGKLTLKFICTTGKLPVPWPTLVTTLTYGVQCFARYPDHMKQHDFFKSAMPEGYVQERTIFFKDDGNYKTRAEVKFEGDTLVNRIELKGIDFKEDGNILGHKLEYNYNSHNVYITADKQKNGIKANFKIRHNIEDGGVQLADHYQQNTPIGDGPVLLPDNHYLSTQSKLSKDPNEKRDHMVLLEFVTAAGITLGMDELYK,sgfp2,32.2,512,495,46000,,,default,5.9,0.7,sgfp2_default,b,,TR5BB
m,10.1021/bi0622874,,,SGFP2(206A),,,,MVSKGEELFTGVVPILVELDGDVNGHKFSVSGEGEGDATYGKLTLKFICTTGKLPVPWPTLVTTLTYGVQCFARYPDHMKQHDFFKSAMPEGYVQERTIFFKDDGNYKTRAEVKFEGDTLVNRIELKGIDFKEDGNILGHKLEYNYNSHNVYITADKQKNGIKANFKIRHNIEDGGVQLADHYQQNTPIGDGPVLLPDNHYLSTQSALSKDPNEKRDHMVLLEFVTAAGITLGMDELYK,sgfp2206a,30.36,512,496,44000,,,default,6.0,0.69,sgfp2206a_default,b,,LS1K6
m,10.1021/ja400098b,,,SHardonnay,3V3D,,,MVSKGEELFTGVVPILVELDGDVNGHKFSVSGEGEGDATYGKLTLKFICTTGKLPVPWPTLVTTFGYGLQCFARYPDHMKQHDFFKSAMPEGYVQERTIFFKDDGNYKTRAEVKFEGDTLVNRIELKGIDFKEDGNILGHKLEYNYNSHNVYIMADKQKNGIKVNFKIRHNIEDGSVQLADHYQQNTPIGDGPVLLPDNHYLSFQSALSKDPNEKRDHMVLLEFVTAAGITLGMDELYK,shardonnay,66.75,530,511,89000,3.4,,default,,0.75,shardonnay_default,b,,6VP2A
m,,,,TagYFP,,,,MVSKGEELFAGIVPVLIELDGDVHGHKFSVRGEGEGDADYGKLEIKFICTTGKLPVPWPTLVTTLTYGVQCFARYPKHMKMNDFFKSAMPEGYIQERTILFQDDGKYKTRGEVKFEGDTLVNRIELKGKDFKEDGNILGHKLEYSFNSHNVYITPDKANNGLEVNFKTRHNIEGGGVQLADHYQTNVPLGDGPVLIPINHYLSYQTDISKDRNEARDHMVLLESVSACSHTHGMDELYR,tagyfp,31.0,524,508,50000,,,default,5.5,0.62,tagyfp_default,b,,V7M33
m,10.1038/srep00608,,,WasCFP,5DQB,5DRF,5DRG,MVSKGEELFTGVVPILVELDGDVNGHKFSVSGEGEGDATYGKLTLKFICTTGKLPVPWPTLKTTLTWGVQCFARYPDHMKQHDFFKSAMPEGYVQERTIFFKDDGNYKTRAEVKFEGDTLVNRIELKGIDFKEDGNILGHKLEYNAISGNVNITADKQKNGIKANFKIRHNIEDGSVQLADHYQQNTPIGDGPVLLPDNHYLSTQSKQSKDPNEKRDHMVLLEFVTAAGITLGMDELYK,wascfp,43.35,505,494,51000,5.1,,default,6.9,0.85,wascfp_default,b,,V7NZK
