agg,doi,genbank,ipg_id,name,pdb.0,seq,slug,states.0.brightness,states.0.em_max,states.0.ex_max,states.0.ext_coeff,states.0.lifetime,states.0.maturation,states.0.name,states.0.pka,states.0.qy,states.0.slug,switch_type,uniprot,uuid
m,10.1038/s41467-019-13897-6,MN701051,,emiRFP670,,MAEGSVARQPDLLTCEHEEIHLAGSIQPHGALLVVSEHDHRVIQASANAAEFLNLGSVLGVPLAEIDGDLLIKILPHLDPTAEGMPVAVRCRIGNPSTEYCGLMHRPPEGGLIIELERAGPSIDLSGTLAPALERIRTAGSLRALCDDTVLLFQQCTGYDRVMVYRFDEQGHGLVFSECHVPGLESYFGNRYPSSTVPQMARQLYVRQRVRVLVDVTYQPVPLEPRLSPLTGRDLDMSGCFLRSMSPCHLQFLKDMGVRATLAVSLVVGGKLWGLVVCHHYLPRFIRFELRAICKRLAERIATRITALES,emirfp670,12.24,670,642,87400,1.53,,default,4.5,0.14,emirfp670_default,b,,YHJV5
d,10.1038/nmeth.2521,AGN32863,,iRFP670,,MARKVDLTSCDREPIHIPGSIQPCGCLLACDAQAVRITRITENAGAFFGRETPRVGELLADYFGETEAHALRNALAQSSDPKRPALIFGWRDGLTGRTFDISLHRHDGTSIIEFEPAAAEQADNPLRLTRQIIARTKELKSLEEMAARVPRYLQAMLGYHRVMLYRFADDGSGMVIGEAKRSDLESFLGQHFPASLVPQQARLLYLKNAIRVVSDSRGISSRIVPEHDASGAALDLSFAHLRSISPCHLEFLRNMGVSASMSLSIIIDGTLWGLIICHHYEPRAVPMAQRVAAEMFADFLSLHFTAAHHQR,irfp670,12.54,670,643,114000,,,default,4.0,0.11,irfp670_default,b,,Q5DYR
m,10.1038/ncomms12405,AOD74926,,miRFP670,,MVAGHASGSPAFGTASHSNCEHEEIHLAGSIQPHGALLVVSEHDHRVIQASANAAEFLNLGSVLGVPLAEIDGDLLIKILPHLDPTAEGMPVAVRCRIGNPSTEYCGLMHRPPEGGLIIELERAGPSIDLSGTLAPALERIRTAGSLRALCDDTVLLFQQCTGYDRVMVYRFDEQGHGLVFSECHVPGLESYFGNRYPSSTVPQMARQLYVRQRVRVLVDVTYQPVPLEPRLSPLTGRDLDMSGCFLRSMSPCHLQFLKDMGVRATLAVSLVVGGKLWGLVVCHHYLPRFIRFELRAICKRLAERIATRITALES,mirfp670,12.24,670,642,87400,1.42,180.0,default,4.5,0.14,mirfp670_default,b,,DP999
m,10.1038/s41467-019-13897-6,,,miRFP670-2,,MARKVDLTSCDREPIHIPGSIQPCGCLLACDAQAVRITRITENAGAFFGRETPRVGELLADYFGETEAHALRNALAQSSDPKRPALIFGWRDGLTGRTFDISLHRHDGTSIIEFEPAAAEQADNPLRLTRQIIARTKELKSLEEMAARVPRYLQAMLGYHRVMLYRFADDGSGMVIGEAKRSDLESFLGQHFPASLVPQQARLLYLKNAIRVVSDSRGISSRIVPEHDASGAALDLSFAHLRSISPCHLEFLRNMGVSASMSLSIIIDGTLWGLIICHHYEPRAVPMAQRVAAKRFAERLSTHFTAAHHQR,mirfp670-2,14.01,670,643,103000,1.42,,default,4.5,0.136,mirfp670-2_default,b,,1KUE6
m,10.1038/s41467-018-08050-8,MK176509,,miRFP670nano,6MGH,MANLDKMLNTTVTEVRQFLQVDRVCVFQFEEDYSGVVVVEAVDDRWISILKTQVRDRYFMETRGEEYSHGRYQAIADIYTANLTECYRDLLTQFQVRAILAVPILQGKKLWGLLVAHQLAAPRQWQTWEIDFLKQQAVVVGIAIQQS,mirfp670nano,10.26,670,645,95000,,100.0,default,3.7,0.108,mirfp670nano_default,b,,1KNNM
m,10.1038/ncomms12405,,,miRFP670v1,,MVAGHASGSPAFGTASHSNSEHEEIHLAGSIQPHGALLVVSEHDHRVIQASANAAEFLNLGSVLGVPLAEIDGDLLIKILPHLDPTAEGMPVAVRCRIGNPSTEYCGLMHRPPEGGLIIELERAGPSIDLSGTLAPALERIRTAGSLRALCDDTVLLFQQCTGYDRVMVYRFDEQGHGLVFSECHVPGLESYFGNRYPSSTVPQMARQLYVRQRVRVLVDVTYQPVPLEPRLSPLTGRDLDMSGCFLRSMSPCHLQFLKDMGVRATLAVSLVVGGKLWGLVVCHHYLPRFIRFELRAICKRLAERIATRITALES,mirfp670v1,8.27,670,644,71300,,,default,4.5,0.116,mirfp670v1_default,b,,GCOU1
d,10.1038/nmeth.3935,KX449134,ANW47198.1,smURFP,6FZN,MAKTSEQRVNIATLLTENKKKIVDKASQDLWRRHPDLIAPGGIAFSQRDRALCLRDYGWFLHLITFCLLAGDKGPIESIGLISIREMYNSLGVPVPAMMESIRCLKEASLSLLDEEDANETAPYFDYIIKAMS,smurfp,32.4,670,642,180000,1.4,39.0,default,3.2,0.18,smurfp_default,b,,HGBNQ
td,10.1038/nmeth.3935,KX449135,,TDsmURFP,,MAKTSEQRVNIATLLTENKKKIVDKASQDLWRRHPDLIAPGGIAFSQRDRALCLRDYGWFLHLITFCLLAGDKGPIESIGLISIREMYNSLGVPVPAMMESIRCLKEASLSLLDEEDANETAPYFDYIIKAMSGHGTGSTGSGSSGTASSEDNNMAMAKTSEQRVNIATLLTENKKKIVDKASQDLWRRHPDLIAPGGIAFSQRDRALCLRDYGWFLHLITFCLLAGDKGPIESIGLISIREMYNSLGVPVPAMMESIRCLKEASLSLLDEEDANETAPYFDYIIKAMS,tdsmurfp,30.6,670,642,170000,,,default,,0.18,tdsmurfp_default,b,,MZOGH
