agg,doi,genbank,ipg_id,name,pdb.0,pdb.1,seq,slug,states.0.brightness,states.0.em_max,states.0.ex_max,states.0.ext_coeff,states.0.lifetime,states.0.maturation,states.0.name,states.0.pka,states.0.qy,states.0.slug,switch_type,uniprot,uuid
d,10.1016/j.bbamcr.2018.08.015,MG727536,,BDFP1.6,,,MANREVVETLKELLADGEKRVQVAGVIGTNAAEVVKTAVSLLFQEYPELVSPGGCAYTTRRYNMCVRDMNYFLRMCSYAIVAGGASVLDGRMLAGFRDTFNSLGIPLCPAARGIQLMKKIVKEKLATAGMTNIAFVDEPFDYIARVISETEI,bdfp16,19.7,666,642,100000,,,default,,0.197,bdfp16_default,b,,QNYK6
m,10.1126/science.1168683,AE001825,AAF12261.1,DrCBD,1ztu,,MSRDPLPFFPPLYLGGPEITTENCEREPIHIPGSIQPHGALLTADGHSGEVLQMSLNAATFLGQEPTVLRGQTLAALLPEQWPALQAALPPGCPDALQYRATLDWPAAGHLSLTVHRVGELLILEFEPTEAWDSTGPHALRNAMFALESAPNLRALAEVATQTVRELTGFDRVMLYKFAPDATGEVIAEARREGLHAFLGHRFPASDIPAQARALYTRHLLRLTADTRAAAVPLDPVLNPQTNAPTPLGGAVLRATSPMHMQYLRNMGVGSSLSVSVVVGGQLWGLIACHHQTPYVLPPDLRTTLEYLGRLLSLQVQVKEA,drcbd,,622,416,,,,default,,,drcbd_default,b,Q9RZA4,Y2WTN
m,10.1038/s41467-019-13897-6,MN701051,,emiRFP670,,,MAEGSVARQPDLLTCEHEEIHLAGSIQPHGALLVVSEHDHRVIQASANAAEFLNLGSVLGVPLAEIDGDLLIKILPHLDPTAEGMPVAVRCRIGNPSTEYCGLMHRPPEGGLIIELERAGPSIDLSGTLAPALERIRTAGSLRALCDDTVLLFQQCTGYDRVMVYRFDEQGHGLVFSECHVPGLESYFGNRYPSSTVPQMARQLYVRQRVRVLVDVTYQPVPLEPRLSPLTGRDLDMSGCFLRSMSPCHLQFLKDMGVRATLAVSLVVGGKLWGLVVCHHYLPRFIRFELRAICKRLAERIATRITALES,emirfp670,12.24,670,642,87400,1.53,,default,4.5,0.14,emirfp670_default,b,,YHJV5
m,10.1038/s41467-019-13897-6,MN701053,,emiRFP703,,,MAEGSVARQPDLLTCEHEEIHLAGSIQPHGALLVVSEHDHRVIQASANAAEFLNLGSVLGVPLAEIDGDLLIKILPHLDPTAEGMPVAVRCRIGNPSTEYCGLMHRPPEGGLIIELERAGPSIDLSGTLAPALERIRTAGSLRALCDDTVLLFQQCTGYDRVMVYRFDEQGHGLVFSECHVPGLESYFGNRYPSSLVPQMARQLYVRQRVRVLVDVTYQPVPLEPRLSPLTGRDLDMSGCFLRSMSPIHLQFLKDMGVRATLAVSLVVGGKLWGLVVCHHYLPRFIRFELRAICKRLAERIATRITALES,emirfp703,7.82,703,674,90900,,,default,4.5,0.086,emirfp703_default,b,,GNJK5
m,10.1126/science.1168683,,,iFP1.4,4O8G,5AJG,MARDPLPFFPPLYLGGPEITTENCEREPIHIPGSIQPHGALLTADGHSGEVLQVSLNAATFLGQEPTVLRGQTLAALLPEQWPALQAALPPGCPDALQYRATLDWPAAGHLSLTVHRVAELLILEFEPTEAWDSIGPHALRNAMFALESAPNLRALAEVATQTVRELTGFDRVMLYKFAPDATGEMIAEARREGMQAFLGHRFPASHTPAQARALYTRHLLRLTADTRAAAVPLDPVLNPQTNAPTPLGGAVLRATSPMHMQYLRNMGVGSSLSVSVVVGGQLWGLIVCHHQTPYVLPPDLRTTLEELGRKLSGQVQRKEA,ifp14,6.44,708,684,92000,,114.0,default,4.6,0.07,ifp14_default,b,,WSRVG
d,10.1038/ncomms4626,,,iFP2.0,4CQH,,MARDPQPFFPPLYLGGPEITTENCEREPIHIPGSIQPHGALLTADGHSGEVLQVSLNAATFLGQEPTVLRGQTLAALLPDQWPALQTALPPGCQDALQYRATLDWPAAGHLSLTVHRVAELLILEFEPTEAWDSIGPHALRNAMFALESAPNLRALAEVATQTVRELSGFDRVMLYKFAPDATGEVIAEARREGMQAYLGHRFPASTTPAQARALYTRHLLRLTADTRAAAVPLDPVLNPQTNAPTPLGGAVLRATSPMHMQYLRNMGVGSSLSVSVVVGGQLWGLIVCHHQTPYVLPPDLRTTLEYLGRLLSLQVQRKEA,ifp20,6.88,711,690,86000,,,default,,0.08,ifp20_default,b,,B53TZ
d,10.1038/nmeth.2521,AGN32863,,iRFP670,,,MARKVDLTSCDREPIHIPGSIQPCGCLLACDAQAVRITRITENAGAFFGRETPRVGELLADYFGETEAHALRNALAQSSDPKRPALIFGWRDGLTGRTFDISLHRHDGTSIIEFEPAAAEQADNPLRLTRQIIARTKELKSLEEMAARVPRYLQAMLGYHRVMLYRFADDGSGMVIGEAKRSDLESFLGQHFPASLVPQQARLLYLKNAIRVVSDSRGISSRIVPEHDASGAALDLSFAHLRSISPCHLEFLRNMGVSASMSLSIIIDGTLWGLIICHHYEPRAVPMAQRVAAEMFADFLSLHFTAAHHQR,irfp670,12.54,670,643,114000,,,default,4.0,0.11,irfp670_default,b,,Q5DYR
d,10.1038/nmeth.2521,AGN32864,,iRFP682,,,MAEGSVARQPDLLTCDDEPIHIPGAIQPHGLLLALAADMTIVAGSDNLPELTGLAIGALIGRSAADVFDSETHNRLTIALAEPGAAVGAPITVGFTMRKDAGFIGSWHRHDQLIFLELEPPQRDVAEPQAFFRRTNSAIRRLQAAETLESACAAAAQEVRKITGFDRVMIYRFASDFSGVVIAEDRCAEVESKLGLHYPASAVPAQARRLYTINPVRIIPDINYRPVPVTPDLNPVTGRPIDLSFAILRSVSPCHLEFMRNIGMHGTMSISILRGERLWGLIVCHHRTPYYVDLDGRQACELVAQVLAWQIGVMEE,irfp682,9.9,682,663,90000,0.95,,default,4.5,0.11,irfp682_default,b,,N3G27
d,10.1038/nmeth.2521,AGN32865,,iRFP702,,,MARKVDLTSCDREPIHIPGSIQPCGCLLACDAQAVRITRITENAGAFFGRETPRVGELLADYFGETEAHALRNALAQSSDPKRPALIFGWRDGLTGRTFDISLHRHDGTSIVEFEPAAAEQADNPLRLTRQIIARTKELKSLEEMAARVPRYLQAMLGYHRVMLYRFADDGSGKVIGEAKRSDLESFLGQHFPASLVPQQARLLYLKNAIRVVSDSRGISSRIVPEHDASGAALDLSFAHLRSISPIHLEFLRNMGVSASMSLSIIIDGTLWGLIICHHYEPRAVPMAQRVAAEMFADFLSLHFTAAHHQR,irfp702,7.44,702,673,93000,,,default,4.5,0.08,irfp702_default,b,,7WEWT
d,10.1038/nbt.1918,AEL88490,,iRFP713,,,MAEGSVARQPDLLTCDDEPIHIPGAIQPHGLLLALAADMTIVAGSDNLPELTGLAIGALIGRSAADVFDSETHNRLTIALAEPGAAVGAPITVGFTMRKDAGFIGSWHRHDQLIFLELEPPQRDVAEPQAFFRRTNSAIRRLQAAETLESACAAAAQEVRKITGFDRVMIYRFASDFSGEVIAEDRCAEVESKLGLHYPASTVPAQARRLYTINPVRIIPDINYRPVPVTPDLNPVTGRPIDLSFAILRSVSPVHLEFMRNIGMHGTMSISILRGERLWGLIVCHHRTPYYVDLDGRQACELVAQVLAWQIGVMEE,irfp713,6.3,713,690,105000,,168.0,default,4.0,0.06,irfp713_default,b,,DGXFA
d,10.1038/srep18750,,,iRFP713/V256C,,,MAEGSVARQPDLLTCDDEPIHIPGAIQPHGLLLALAADMTIVAGSDNLPELTGLAIGALIGRSAADVFDSETHNRLTIALAEPGAAVGAPITVGFTMRKDAGFIGSWHRHDQLIFLELEPPQRDVAEPQAFFRRTNSAIRRLQAAETLESACAAAAQEVRKITGFDRVMIYRFASDFSGEVIAEDRCAEVESKLGLHYPASTVPAQARRLYTINPVRIIPDINYRPVPVTPDLNPVTGRPIDLSFAILRSVSPCHLEFMRNIGMHGTMSISILRGERLWGLIVCHHRTPYYVDLDGRQACELVAQVLAWQIGVMEE,irfp713v256c,13.63,680,662,94000,,,default,4.5,0.145,irfp713v256c_default,b,,3G1CL
d,10.1038/nmeth.2521,AGN32866,,iRFP720,,,MAEGSVARQPDLLTCDDEPIHIPGAIQPHGLLLALAADMTIVAGSDNLPELTGLAIGALIGRSAADVFDSETHNRLTIALAEPGAAVGAPITVGFTMRKDAGFIGSWHRHDQLIFLELEPPQRDVAEPQAFFRRTNSAIRRLQAAETLESACAAAAQEVRKITGFDRVMIYRFASDFSGSVIAEDRCAEVESKLGLHYPASFIPAQARRLYTINPVRIIPDINYRPVPVTPDLNPVTGRPIDLSFAILRSVSPNHLEFMRNIGMHGTMSISILRGERLWGLIVCHHRTPYYVDLDGRQACELVAQVLAWQIGVMEE,irfp720,5.76,720,702,96000,,,default,4.5,0.06,irfp720_default,b,,OX75X
m,10.1038/nmeth.3447,,,mIFP,,,MSVPLTTSAFGHAFLANCEREQIHLAGSIQPHGILLAVKEPDNVVIQASINAAEFLNTNSVVGRPLRDLGGDLPLQILPHLNGPLHLAPMTLRCTVGSPPRRVDCTIHRPSNGGLIVELEPATKTTNIAPALDGAFHRITSSSSLMGLCDETATIIREITGYDRVMVVRFDEEGNGEILSERRRADLEAFLGNRYPASTIPQIARRLYEHNRVRLLVDVNYTPVPLQPRISPLNGRDLDMSLSCLRSMSPIHQKYMQDMGVGATLVCSLMVSGRLWGLIACHHYEPRFVPFHIRAAGEALAETCAIRIATLESFAQSQSK,mifp,6.56,704,683,82000,,,default,3.5,0.08,mifp_default,b,,LDVKW
m,10.1038/s41589-018-0004-9,MG250278.1,,miRFP,,,MVAGHASGSPDFGTADPSDCEREEIHLAGSIQPHGTLLVVSEPDHRIIQASANAAEFLNLGSVLGVPLAEIDGDLLIKILPHLDPTAEGMPVAVRCRIGNPSTEYDGLMHRPPEGGLIIELERAGPPIDLSGTLAPALERIRTAGSLRALCDDTALLFQQCTGYDRVMVYRFDEQGHGEVYSEIHVTGLESYFGNRYPSSLVPQMARRLYERQRVRVLVDVSYQPVPLEPRLSPLTGRDLDMSGCFLRSMSPTHLQFLKNMGVRATLVVSLVVGGKLWGLVICHHYLPRFIHFELRAICELLAEAIATRITAL,mirfp,8.96,703,674,92400,,,default,4.3,0.097,mirfp_default,b,,HO9GG
m,10.1101/2021.08.02.454744,MZ682639,,miRFP2,,,MVAGHASGSPDFGTASPSDCEHEEIHLAGSIQPHGTLLVVSEPDHRIIQASANAAEFLNLGSVLGIPLAEIDGDLLIKILPHLDLTAEGMPVAVRCRIGNPSTEYDGLMHRPPEGGLIIELERAGPSIDLSGTLAPALERIRTAGSLRALCDDTVLLFQQCTGYDRVMVYRFDERGHGEVYSEIHVTGLESYFGNRYPSSLVPQMARRLYVRQRVRVLVDVTYQPVPLEPRLSPLTGRDLDMSGCFLRSMSPTHLQFLKNMGVRATLVVSLVVGGKLWGLVICHHYLPRFIHFELRAICVLLAEAIATRITAL,mirfp2,2.39,706,676,55600,,,default,3.7,0.043,mirfp2_default,b,,AYRSR
m,10.1038/ncomms12405,AOD74926,,miRFP670,,,MVAGHASGSPAFGTASHSNCEHEEIHLAGSIQPHGALLVVSEHDHRVIQASANAAEFLNLGSVLGVPLAEIDGDLLIKILPHLDPTAEGMPVAVRCRIGNPSTEYCGLMHRPPEGGLIIELERAGPSIDLSGTLAPALERIRTAGSLRALCDDTVLLFQQCTGYDRVMVYRFDEQGHGLVFSECHVPGLESYFGNRYPSSTVPQMARQLYVRQRVRVLVDVTYQPVPLEPRLSPLTGRDLDMSGCFLRSMSPCHLQFLKDMGVRATLAVSLVVGGKLWGLVVCHHYLPRFIRFELRAICKRLAERIATRITALES,mirfp670,12.24,670,642,87400,1.42,180.0,default,4.5,0.14,mirfp670_default,b,,DP999
m,10.1038/s41467-019-13897-6,,,miRFP670-2,,,MARKVDLTSCDREPIHIPGSIQPCGCLLACDAQAVRITRITENAGAFFGRETPRVGELLADYFGETEAHALRNALAQSSDPKRPALIFGWRDGLTGRTFDISLHRHDGTSIIEFEPAAAEQADNPLRLTRQIIARTKELKSLEEMAARVPRYLQAMLGYHRVMLYRFADDGSGMVIGEAKRSDLESFLGQHFPASLVPQQARLLYLKNAIRVVSDSRGISSRIVPEHDASGAALDLSFAHLRSISPCHLEFLRNMGVSASMSLSIIIDGTLWGLIICHHYEPRAVPMAQRVAAKRFAERLSTHFTAAHHQR,mirfp670-2,14.01,670,643,103000,1.42,,default,4.5,0.136,mirfp670-2_default,b,,1KUE6
m,10.1038/s41467-018-08050-8,MK176509,,miRFP670nano,6MGH,,MANLDKMLNTTVTEVRQFLQVDRVCVFQFEEDYSGVVVVEAVDDRWISILKTQVRDRYFMETRGEEYSHGRYQAIADIYTANLTECYRDLLTQFQVRAILAVPILQGKKLWGLLVAHQLAAPRQWQTWEIDFLKQQAVVVGIAIQQS,mirfp670nano,10.26,670,645,95000,,100.0,default,3.7,0.108,mirfp670nano_default,b,,1KNNM
m,10.1038/ncomms12405,,,miRFP670v1,,,MVAGHASGSPAFGTASHSNSEHEEIHLAGSIQPHGALLVVSEHDHRVIQASANAAEFLNLGSVLGVPLAEIDGDLLIKILPHLDPTAEGMPVAVRCRIGNPSTEYCGLMHRPPEGGLIIELERAGPSIDLSGTLAPALERIRTAGSLRALCDDTVLLFQQCTGYDRVMVYRFDEQGHGLVFSECHVPGLESYFGNRYPSSTVPQMARQLYVRQRVRVLVDVTYQPVPLEPRLSPLTGRDLDMSGCFLRSMSPCHLQFLKDMGVRATLAVSLVVGGKLWGLVVCHHYLPRFIRFELRAICKRLAERIATRITALES,mirfp670v1,8.27,670,644,71300,,,default,4.5,0.116,mirfp670v1_default,b,,GCOU1
m,10.1038/s41467-019-13897-6,MN701052,,miRFP680,,,MAEGSVARQPDLLTCDDEPIHIPGAIQPHGLLLALAADMTIVAGSDNLPELTGLAIGALIGRSAADVFDSETHNRLTIALAEPGAAVGAPITVGFTMRKDAGFIGSWHRHDQLIFLELEPPQRDVAEPQAFFRRTNSAIRRLQAAETLESACAAAAQEVRKITGFDRVMIYRFASDFSGEVIAEDRCAEVESKLGLHYPASTVPAQARRLYTINPVRIIPDINYRPVPVTPDLNPVTGRPIDLSFAILRSVSPCHLEFMRNIGMHGTMSISILRGERLWGLIVCHHRTPYYVDLDGRQACKRVAERLATQIGVMEE,mirfp680,13.63,680,661,94000,1.67,,default,4.5,0.145,mirfp680_default,b,,RAKQZ
m,10.1038/s41467-019-13897-6,,,miRFP682,,,MAEGSVARQPDLLTCDDEPIHIPGAIQPHGLLLALAADMTIVAGSDNLPELTGLAIGALIGRSAADVFDSETHNRLTIALAEPGAAVGAPITVGFTMRKDAGFIGSWHRHDQLIFLELEPPQRDVAEPQAFFRRTNSAIRRLQAAETLESACAAAAQEVRKITGFDRVMIYRFASDFSGVVIAEDRCAEVESKLGLHYPASAVPAQARRLYTINPVRIIPDINYRPVPVTPDLNPVTGRPIDLSFAILRSVSPCHLEFMRNIGMHGTMSISILRGERLWGLIVCHHRTPYYVDLDGRQACKRVAERLATQIGVMEE,mirfp682,10.19,682,663,91000,,,default,4.5,0.112,mirfp682_default,b,,X1DTP
m,10.1038/s41467-019-13897-6,,,miRFP702,,,MARKVDLTSCDREPIHIPGSIQPCGCLLACDAQAVRITRITENAGAFFGRETPRVGELLADYFGETEAHALRNALAQSSDPKRPALIFGWRDGLTGRTFDISLHRHDGTSIVEFEPAAAEQADNPLRLTRQIIARTKELKSLEEMAARVPRYLQAMLGYHRVMLYRFADDGSGKVIGEAKRSDLESFLGQHFPASLVPQQARLLYLKNAIRVVSDSRGISSRIVPEHDASGAALDLSFAHLRSISPIHLEFLRNMGVSASMSLSIIIDGTLWGLIICHHYEPRAVPMAQRVAAKRFAERLSTHFTAAHHQR,mirfp702,7.13,702,673,88000,,,default,4.5,0.081,mirfp702_default,b,,55FPY
m,10.1038/ncomms12405,,,miRFP703,,,MVAGHASGSPAFGTASHSNCEHEEIHLAGSIQPHGALLVVSEHDHRVIQASANAAEFLNLGSVLGVPLAEIDGDLLIKILPHLDPTAEGMPVAVRCRIGNPSTEYCGLMHRPPEGGLIIELERAGPSIDLSGTLAPALERIRTAGSLRALCDDTVLLFQQCTGYDRVMVYRFDEQGHGLVFSECHVPGLESYFGNRYPSSLVPQMARQLYVRQRVRVLVDVTYQPVPLEPRLSPLTGRDLDMSGCFLRSMSPIHLQFLKDMGVRATLAVSLVVGGKLWGLVVCHHYLPRFIRFELRAICKRLAERIATRITALES,mirfp703,7.82,703,674,90900,,,default,4.5,0.086,mirfp703_default,b,,1B7TK
m,10.1038/ncomms12405,,,miRFP709,,,MVAGHASGSPAFGTASHSNCEHEEIHLAGSIQPHGALLVVSEHDHRVIQASANAAEFLNLGSVLGVPLAEIDGDLLIKILPHLDPTAEGMPVAVRCRIGNPSTEYCGLMHRPPEGGLIIELERAGPSIDLSGTLAPALERIRTAGSLRALCDDTVLLFQQCTGYDRVMVYRFDEQGHGLVFSECHVPGLESYFGNRYPSSFIPQMARQLYVRQRVRVLVDVTYQPVPLEPRLSPLTGRDLDMSGCFLRSMSPIHLQFLKDMGVRATLAVSLVVGGKLWGLVVCHHYLPRFIRFELRAICKRLAERIATRITALES,mirfp709,4.23,709,683,78400,,,default,4.5,0.054,mirfp709_default,b,,Q6V69
m,10.1038/s41467-019-13897-6,MN701054,,miRFP713,,,MAEGSVARQPDLLTCDDEPIHIPGAIQPHGLLLALAADMTIVAGSDNLPELTGLAIGALIGRSAADVFDSETHNRLTIALAEPGAAVGAPITVGFTMRKDAGFIGSWHRHDQLIFLELEPPQRDVAEPQAFFRRTNSAIRRLQAAETLESACAAAAQEVRKITGFDRVMIYRFASDFSGEVIAEDRCAEVESKLGLHYPASTVPAQARRLYTINPVRIIPDINYRPVPVTPDLNPVTGRPIDLSFAILRSVSPVHLEFMRNIGMHGTMSISILRGERLWGLIVCHHRTPYYVDLDGRQACKRVAERLATQIGVMEE,mirfp713,6.93,713,690,99000,0.89,,default,3.5,0.07,mirfp713_default,b,,2EG15
m,10.1038/s41589-018-0044-1,,,miRFP720,,,MAEGSVARQPDLLTCDDEPIHIPGAIQPHGLLLALAADMTIVAGSDNLPELTGLAIGALIGRSAADVFDSETHNRLTIALAEPGAAVGAPITVGFTMRKDAGFIGSWHRHDQLIFLELEPPQRDVAEPQAFFRRTNSAIRRLQAAETLESACAAAAQEVRKITGFDRVMIYRFASDFSGEVIAEDRCAEVESKLGLHYPASFIPAQARRLYTINPVRIIPDINYRPVPVTPDLNPVTGRPIDLSFAILRSVSPVHLEFMRNIGMHGTMSISILRGERLWGLIVCHHRTPYYVDLDGRQACKRVAERLATQIGVMEE,mirfp720,5.98,720,702,98000,,,default,4.5,0.061,mirfp720_default,b,,AJLWS
m,10.1038/s41598-019-52123-7,,,mRhubarb713,,,MAEGSVARQPDLLTCDDEPIHIPGAIQPHGLLLALAADMTIVAGSDNLPELTGLAIGALIGRSAADVFDSETHNRLTIALAEPGAAVGAPITVGFTMRKDAGFIGSWHRHDQLIFLELEPPQRDVAEPQAFFRHTNSAIRRLQAAETLESACAAAAQEVRKITGFDRVMIYRFASDFSGEVIAEDRCAEVESKLGLHYPASTVPAQARRLYTINPVRIIPDINYRPVPVTPDLNPVTGRPIDLSFAILRSVSPVHLEFMRNIGMHGTMSISILRGERLWGLIVCHHRTPYYVDLDGRQACELVAQVLARAIGVMEE,mrhubarb713,8.66,713,690,113457,,,Pr,,0.0763,mrhubarb713_pr,b,,OZEBT
m,10.1038/s41598-019-52123-7,,,mRhubarb719,,,MAEGSVARQPDLLTCDDEPIHIPGAIQPHGLLLALAADMTIVAGSDNLPELTGLAIGALIGRSAADVFDSETHNRLTIALAEPGAAVGAPITVGFTMRKDAGFIGSWHRHDQLIFLELEPPQRDVAEPQAFFRHTNSAIRRLQAAETLESACAAAAQEVRKITGFDRVMIYRFASDFSGEVIAEDRCAEVESKLGLHSPASYIPAQARRLYTINPVRIIPDINYRPVPVTPDLNPVTGRPIDLSFAILRSVSPVHLEFMRNIGMHGTMSISILRGERLWGLIVCHHRTPYYVDLDGRQACELVAQVLARAIGVMEE,mrhubarb719,5.7,719,700,83768,,,Pr,,0.068,mrhubarb719_pr,b,,TUP2T
m,10.1038/s41598-019-52123-7,,,mRhubarb720,,,MAEGSVARQPDLLTCDDEPIHIPGAIQPHGLLLALAADMTIVAGSDNLPELTGLAIGALIGRSAADVFDSETHNRLTIALAEPGAAVGAPITVGFTMRKDAGFIGSWHRHDQLIFLELEPPQRDVAEPQAFFRHTNSAIRRLQAAETLESACAAAAQEVRKITGFDRVMIYRFASDFSGEVIAEDRCAEVESKLGQHYPASDIPAQARRLYTINPVRIIPDINYRPVPVTPDLNPVTGRPIDLSFAILRSVSPVHLEFMRNIGMHGTMSISILRGERLWGLIVCHHRTPYYVDLDGRQACELVAQVLARAIGVMEE,mrhubarb720,6.13,720,701,94941,,,Pr,,0.0646,mrhubarb720_pr,b,,PV8DK
m,10.1039/c4pp00336e,WP_012410140,,NpR3784g,,,MANLDKVLNTTVTEVRQFLQVDRVFMYQFEPDYSGVVVVESVDDRWIAILNTQVQDTYFMETRGEEYSHGRIQAIADIYTAGLTECHRDLLTQFQVRANLAVPILQGKKLWGLLVANQLAAPRQWQTWEIDFLKQLAVQVGIAIQQSQL,npr3784g,,,,,,,,,,,,,7T72C
,10.1016/j.str.2012.06.002,,,RpBphP1,5OY5,,MVAGHASGSPAFGTADLSNCEREEIHLAGSIQPHGALLVVSEPDHRIIQASANAAEFLNLGSVLGVPLAEIDGDLLIKILPHLDPTAEGMPVAVRCRIGNPSTEYDGLMHRPPEGGLIIELERAGPPIDLSGTLAPALERIRTAGSLRALCDDTALLFQQCTGYDRVMVYRFDEQGHGEVFSERHVPGLESYFGNRYPSSDIPQMARRLYERQRVRVLVDVSYQPVPLEPRLSPLTGRDLDMSGCFLRSMSPIHLQYLKNMGVRATLVVSLVVGGKLWGLVACHHYLPRFIHFELRAICELLAEAIATRITALES,rpbphp1,,,,,,,,,,,,,Q54M6
t,10.1073/pnas.1525622113,,,Sandercyanin,5F6Z,5EZ2,MFIKPGRCPKPAVQEDFDAARYLGVWYDIQRLPNKFQKGECATATYSLSPGVGFSVFNRERLANGTIKSVIGSAIAEDPCEPAKLQFFHENAAPVPYWVLSTDYDNYALVYSCINLGASHAAYASIVSRQPTLPEETIKKLQGTMSSFGVGVDTLLTTNQDAAYCSAMNQ,sandercyanin,0.34,675,375,21000,,,default,,0.016,sandercyanin_default,b,,P9LBW
d,10.1038/nmeth.3935,KX449134,ANW47198.1,smURFP,6FZN,,MAKTSEQRVNIATLLTENKKKIVDKASQDLWRRHPDLIAPGGIAFSQRDRALCLRDYGWFLHLITFCLLAGDKGPIESIGLISIREMYNSLGVPVPAMMESIRCLKEASLSLLDEEDANETAPYFDYIIKAMS,smurfp,32.4,670,642,180000,1.4,39.0,default,3.2,0.18,smurfp_default,b,,HGBNQ
m,10.1038/s41467-018-07246-2,AYH52606,212327017,SNIFP,,,MSRDPLPFFPPLYLGGPEITTENCEREPIHIPGSIQPHGALLTADGHSGEVLQMSLNAATFLGQEPTVLRGQTLAALLPEQWPALQAALPPGCPDALQYRATLDWPAAGHLSLTVHRVGELLILEFEPTEAWDSTGPHALRNAMSALESAPNLRALAEVATQTVRELTGFDRVMLYKFAPDATGEVIAEARREGLHAFLGHRFPASLIPAQARALYTRHLLRLTADTRAAAVPLDPVLNPQTNAPTPLGGAVLRATSPMHMQFLRNMGVRSSLSVSVVVGGQLWGLIACHHQTPYVLPPDLRTTLEYLGRELSEQVQVKE,snifp,3.28,720,697,149200,0.63,,default,,0.022,snifp_default,b,,Q5F5J
td,10.1038/nmeth.3935,KX449135,,TDsmURFP,,,MAKTSEQRVNIATLLTENKKKIVDKASQDLWRRHPDLIAPGGIAFSQRDRALCLRDYGWFLHLITFCLLAGDKGPIESIGLISIREMYNSLGVPVPAMMESIRCLKEASLSLLDEEDANETAPYFDYIIKAMSGHGTGSTGSGSSGTASSEDNNMAMAKTSEQRVNIATLLTENKKKIVDKASQDLWRRHPDLIAPGGIAFSQRDRALCLRDYGWFLHLITFCLLAGDKGPIESIGLISIREMYNSLGVPVPAMMESIRCLKEASLSLLDEEDANETAPYFDYIIKAMS,tdsmurfp,30.6,670,642,170000,,,default,,0.18,tdsmurfp_default,b,,MZOGH
m,10.1074/jbc.m111.295121,,,Wi-Phy,3S7Q,,MASMTGGQQMGRGSMSRDPLPFFPPLYLGGPEITTENCEREPIHIPGSIQPHGALLTADGHSGEVLQMSLNAATFLGQEPTVLRGQTLAALLPEQWPALQAALPPGCPDALQYRATLDWPAAGHLSLTVHRVGELLILEFEPTEAWDSTGPHALRNAMSALESAPNLRALAEVATQTVRELTGFDRVMLYKFAPDATGEVIAEARREGLHAFLGHRFPASHIPAQARALYTRHLLRLTADTRAAAVPLDPVLNPQTNAPTPLGGAVLRATSPMHMQFLRNMGVGSSLSVSVVVGGQLWGLIACHHQTPYVLPPDLRTTLEYLGRELSEQVQVKEA,wi-phy,4.37,719,701,92991,,,default,,0.047,wi-phy_default,b,,V6A1P
