agg,doi,genbank,ipg_id,name,pdb.0,pdb.1,pdb.2,pdb.3,pdb.4,pdb.5,seq,slug,states.0.brightness,states.0.em_max,states.0.ex_max,states.0.ext_coeff,states.0.lifetime,states.0.maturation,states.0.name,states.0.pka,states.0.qy,states.0.slug,states.1.brightness,states.1.em_max,states.1.ex_max,states.1.ext_coeff,states.1.lifetime,states.1.maturation,states.1.name,states.1.pka,states.1.qy,states.1.slug,states.2.brightness,states.2.em_max,states.2.ex_max,states.2.ext_coeff,states.2.lifetime,states.2.maturation,states.2.name,states.2.pka,states.2.qy,states.2.slug,states.3.brightness,states.3.em_max,states.3.ex_max,states.3.ext_coeff,states.3.lifetime,states.3.maturation,states.3.name,states.3.pka,states.3.qy,states.3.slug,switch_type,transitions.0.from_state,transitions.0.to_state,transitions.0.trans_wave,transitions.1.from_state,transitions.1.to_state,transitions.1.trans_wave,transitions.2.from_state,transitions.2.to_state,transitions.2.trans_wave,transitions.3.from_state,transitions.3.to_state,transitions.3.trans_wave,transitions.4.from_state,transitions.4.to_state,transitions.4.trans_wave,uniprot,uuid
,10.1126/science.273.5280.1392,,,11,,,,,,,MSKGEELFTGVVPILVELDGDVNGHKFSVSGEGEGDATYGKLTLKFICTTGKLPVPWPTLVTTFGYGVQCFARYPDHMKQHDFFKSAMPEGYVQERTIFFKDDGNYKTRAEVKFEGDTLVNRIELKGIDFKEDGNILGHKLEYNYNSHNVYIMADKQKNGIKVNFKIRHNIEDGSVQLADHYQQNTPIGDGPVLLPDNHYLSWQSALSKDPNEKRDHMVLLEFVTAAGITHGMDELYK,11,,512,502,33000,,,default,,,11_default,,,,,,,,,,,,,,,,,,,,,,,,,,,,,,,b,,,,,,,,,,,,,,,,,W92N1
,10.1002/cbic.200300818,,,(3-F)Tyr-EGFP,1RRX,,,,,,SKGEELFTGVVPILVELDGDVNGHKFSVSGEGEGDATYGKLTLKFICTTGKLPVPWPTLVTTLGYGVQCFSRYPDHMKQHDFFKSAMPEGYVQERTIFFKDDGNYKTRAEVKFEGDTLVNRIELKGIDFKEDGNILGHKLEYNYNSHNVYIMADKQKNGIKVNFKIRHNIEDGSVQLADHYQQNTPIGDGPVLLPDNHYLSTQSALSKDPNEKRDHMVLLEFVTAAGI,3-ftyr-egfp,,514,484,,,,default,,,3-ftyr-egfp_default,,,,,,,,,,,,,,,,,,,,,,,,,,,,,,,b,,,,,,,,,,,,,,,,,2VPWT
,10.1021/ja3073337,,,A44-KR,4B30,,,,,,MEGGPALFQSDMTFKIFIDGEVNGQKFTIVADGSSKFPHGDFNAHAVCETGKLPMSWKPICHLIQYGEPFFARYPDGISHFAQECFPEGLSIDRTVRFENDGTMTSHHTYELDDTCVVSRITVNCDGFQPDGPIMRDQLVDILPNETHMFPHGPNAVRQLAFIGFTTADGGLMMGHFDSKMTFNGSRAIEIPGPHFVTIITKQMRDTSDKRDHVCQREVAYAHSVPRITSAIGSDED,a44-kr,,520,397,,,,default,,,a44-kr_default,,,,,,,,,,,,,,,,,,,,,,,,,,,,,,,b,,,,,,,,,,,,,,,,,D77WT
t,10.1371/journal.pone.0002680,AAU06848,3620743,aacuGFP1,,,,,,,MSLSKHGITQEMPTKYHMKGSVNGHEFEIEGVGTGHPYEGTHMAELVIIKPAGKPLPFSFDILSTVIQYGNRCFTKYPADLPDYFKQAYPGGMSYERSFVYQDGGIATASWNVGLEGNCFIHKSTYLGVNFPADGPVMTKKTIGWDKAFEKMTGFNEVLRGDVTEFLMLEGGGYHSCQFHSTYKPEKPVELPPNHVIEHHIVRTDLGKTAKGFMVKLVQHAAAHVNPLKVQ,aacugfp1,22.51,502,478,36900,,,default,,0.61,aacugfp1_default,,,,,,,,,,,,,,,,,,,,,,,,,,,,,,,b,,,,,,,,,,,,,,,,Q66PV6,498LC
t,10.1371/journal.pone.0002680,AAU06845,3620755,aacuGFP2,,,,,,,MSYSKQGIVQEMKTKYRMEGSVNGHEFTIEGVGTGYPYEGKQMSELVIIKPKGKPLPFSFDILSSVFQYGNRCFTKYPADMPDYFKQAFPDGMSYERSFLFEDGAVATASWNIRLEGNCFIHNSIFHGVNFPADGPVMKKKTIGWDKSFEKMTVSKEVLRGDVTMFLMLEGGGYHRCQFHSTYKTEKPVELPPNHVVEHQIVRTDLGQSAKGFTVKLEAHAAAHVNPLKVQ,aacugfp2,66.67,513,502,93900,,,default,,0.71,aacugfp2_default,,,,,,,,,,,,,,,,,,,,,,,,,,,,,,,b,,,,,,,,,,,,,,,,Q66PV9,3W5ZV
d,10.1101/677344,,,AausFP1,,,,,,,MSYGALLFREKIPYVVEMEGDVEGMKFSVRGKGHGDANTGKIEASFICTTGELPVPWSSILTTVTYGAQCFAKYPNDIKDYPKSAMPEGYVQERTITFENDGVYKTRAEVTYEKGSVYNRVTLNGSGFKKGGNILGKKLEFNYNPHCIYVLPDVQNNGIKCYINIVHDVIGGGQIIAAHQQLNTPLGGGPVDIPHYHHIQAHTILSKDPKETRDHMNVVEVFRAIDCKTAYA,aausfp1,164.9,510,504,170000,,,default,4.4,0.97,aausfp1_default,,,,,,,,,,,,,,,,,,,,,,,,,,,,,,,b,,,,,,,,,,,,,,,,,C2FJQ
d,10.1101/677344,,,AausFP4,,,,,,,MNCGALLFQQKVPFIVEMEGDVNGEIFSVRGNGFGNATTGKLDILFVCTTGEIPVAWESLISSLAYGAFVFAKYPSNIADFFKSTMPEGYIQERKVTFENDGTYETHATVTYENGAIFERVKLTGTGFREDGNILGKKLEITSLGTPLSIMADDEGKGLRSVFNQAIKVVGGNRQIAIHEQRNRPIGDGLISVPDYHTLHNHLKCSKVSTEKRDHMMVNETLKAIDCQTAYL,aausfp4,,513,477,69000,,,On,,,aausfp4_on,,,,,,,Off,,0.001,aausfp4_off,,,,,,,,,,,,,,,,,,,,,ps,aausfp4_off,aausfp4_on,340,aausfp4_on,aausfp4_off,480,,,,,,,,,,,F5F6H
d,10.1101/677344,,,AausGFP,,,,,,,MKIYCEGEKLFKGIVPIQIELNGDVNGHKFSVHGEGQGEAEMGRLTLRFVCTTGKMPVPWPTLVTTFSYGVQCFSRYPEHMKMHDFFKSAMPEGYTQERTIFFDKDGTYKTRAEVKFEGDTLVNRIELTGTGFKEDGNILGHKMEYNYNSHNVYIMSDKAKNGIKVNFKIRHNIEDGTVQLADHYQANYPLGKGPVLLPEDHYLSTQSALTKDPHETRDHMLLLEFVTAAGITHGMDELYK,aausgfp,21.17,503,398,29000,,,default,4.8,0.73,aausgfp_default,,,,,,,,,,,,,,,,,,,,,,,,,,,,,,,b,,,,,,,,,,,,,,,,,D7QYG
m,10.1074/jbc.m109.092320,AAN41637,1780484,aceGFP,3LVA,,,,,,MSKGAELFTGIVPILIELNGDVNGHKFSVSGEGEGDATYGKLTLKFICTTGKLPVPWPTLVTTLSYGVQCFSRYPDHMKQHDFFKSAMPEGYIQERTIFFEDDGNYKSRAEVKFEGDTLVNRIELTGTDFKEDGNILGNKMEYNYNAHNVYIMTDKAKNGIKVNFKIRHNIEDGSVQLADHYQQNTPIGDGPVLLPDNHYLSTQSALSKDPNEKRDHMIYFGFVTAAAITHGMDELYK,acegfp,27.5,505,480,50000,,,default,,0.55,acegfp_default,,,,,,,,,,,,,,,,,,,,,,,,,,,,,,,b,,,,,,,,,,,,,,,,Q6YGZ0,GQRF2
m,10.1074/jbc.m109.092320,,,aceGFP-G222E-Y220L,,,,,,,MSKGAELFTGIVPILIELNGDVNGHKFSVSGEGEGDATYGKLTLKFICTTGKLPVPWPTLVTTLSYGVQCFSRYPDHMKQHDFFKSAMPEGYIQERTIFFEDDGNYKSRAEVKFEGDTLVNRIELTGTDFKEDGNILGNKMEYNYNAHNVYIMTDKAKNGIKVNFKIRHNIEDGSVQLADHYQQNTPIGDGPVLLPDNHYLSTQSALSKDPNEKRDHMILFEFVTAAAITHGMDELYK,acegfp-g222e-y220l,,508,396,,,,default,,,acegfp-g222e-y220l_default,,,,,,,,,,,,,,,,,,,,,,,,,,,,,,,b,,,,,,,,,,,,,,,,,DH5VX
,10.1042/bj20021966,AAP69597,1780523,aceGFP-h,,,,,,,SKGAELFTGIVPILIELNGDVNGHKFSVSGEGEGDATYGKLTLKFICTTGKLPVPWPTLVTTLSYGVQCFSRYPDHMKQHDFFKSAMPEGYIQERTIFFEDDGNYKSRAEVKFEGDTLVNRIELTGTDFKEDGNILGNKMEYNYNAHNVYIMTDKAKNGIKVNFKIRHNIEDGSVQLADHYQQNTPIGDGPVLLPDNHYLSTQSALSKDPNEKRDHMIYFGFVTAAAITHGMDELYK,acegfp-h,,505,390,,,,default,,,acegfp-h_default,,,,,,,,,,,,,,,,,,,,,,,,,,,,,,,b,,,,,,,,,,,,,,,,,WBLSA
wd,,,,AcGFP1,,,,,,,MVSKGAELFTGIVPILIELNGDVNGHKFSVSGEGEGDATYGKLTLKFICTTGKLPVPWPTLVTTLSYGVQCFSRYPDHMKQHDFFKSAMPEGYIQERTIFFEDDGNYKSRAEVKFEGDTLVNRIELTGTDFKEDGNILGNKMEYNYNAHNVYIMTDKAKNGIKVNFKIRHNIEDGSVQLADHYQQNTPIGDGPVLLPDNHYLSTQSALSKDPNEKRDHMIYFGFVTAAAITHGMDELYK,acgfp1,27.5,505,475,50000,,,default,,0.55,acgfp1_default,,,,,,,,,,,,,,,,,,,,,,,,,,,,,,,b,,,,,,,,,,,,,,,,,6ORKJ
t,10.1371/journal.pone.0002680,ACD13192,14926073,aeurGFP,,,,,,,MSYSKQGIVQEMKTKYHMEGSVNGHEFTIEGVATGYPYEGKQMSELVIIKPKGKPLPFSFDILSSVFQYGNRCFTKYPADIPDYFKQAFPDGMSYERSFLFEDGAVATASWNIRLEGNCFIHNSIFHGVNFPADGPVMKKQTIGWDKSFEKMTVSKEVLRGDVTMFLMLEGGGYHRCQFHSTYKTEKPVTLPPNHVVEHQIVRTDLGQSAKGFTVKLEALAAAHVNPLKVQ,aeurgfp,97.62,515,504,145700,,,default,,0.67,aeurgfp_default,,,,,,,,,,,,,,,,,,,,,,,,,,,,,,,b,,,,,,,,,,,,,,,,B6CTZ3,4NRYW
t,10.1371/journal.pone.0002680,AAU06857,3620756,afraGFP,,,,,,,MSVIVKEMMTKLHMEGTVNGHAFTIEGKGKGDPYNGVQSMNLDVKGGAPLPFSFDLLTPAFMYGNRVFTKYPEDIPDFFKQVFPEGYHWERSITFEDQAVCTATSHIRLDQKEMCFIYDVRFHGVNFPANGPIMQKKILGWEPSTEKMYARDGVLKGDVNMTLRVEGGGHYRADFRTTYKAKKPVNLPGYHFIDHRIEITKHSKDYTNVALYEAAVARHSPLPKVA,afragfp,61.49,503,494,100800,,,default,,0.61,afragfp_default,,,,,,,,,,,,,,,,,,,,,,,,,,,,,,,b,,,,,,,,,,,,,,,,Q66PU5,T5A9C
t,10.1021/bp034308g,AAS18270,2033734,alajGFP1,,,,,,,MSLSKQVIGKEMNMTYLMDGSVNGHNFTVEGEGDGKPYEGHQCLKLRITKGEPLPFAFDILTAAFCYGNRCFVNYPAEIADYFKQAFPEGLTWERSMTFEDGGFAAVSADISLNGNCFVHQSKFVGVNFPADGPVMQKKTVGWEPSTEKMIVRDGILEGDVTMYLKLEGGGNYRCEYRTIYKAKKDVKMPKSHFVEHTLVRNNIKKDAKGNTIELIEDASARY,alajgfp1,,517,509,,,,default,,,alajgfp1_default,,,,,,,,,,,,,,,,,,,,,,,,,,,,,,,b,,,,,,,,,,,,,,,,Q6R8F5,LBAXM
t,10.1021/bp034308g,AAS18271,2033714,alajGFP2,,,,,,,MVLSKQMNMTYLMDGSVNGHNFTVEGEGDGKPYEGHQCLKLRITKGEPLPFAFDILTAAFCYGNRCFVNYPAEIADYFKQAFPEGLTWERSMTFEDGGFAAVSADLSLKNGNWFVHQSKFVGVNFPADGPVMQKKTVGWEPSTEKMIVRDGTLEGDVTMYLKLEGGGNYRCDYRTIYKAKKDVKMPKSHFVEHTLVRNNIKKDAKGNTIELIEDASARY,alajgfp2,,517,509,,,,default,,,alajgfp2_default,,,,,,,,,,,,,,,,,,,,,,,,,,,,,,,b,,,,,,,,,,,,,,,,Q6R8F4,RFJ23
t,10.1021/bp034308g,AAS18272,2033751,alajGFP3,,,,,,,MALSKQEIKKEMTMDYVMDGCVNGHSFTVKGDGAGKPYEGHQRLSLHVTGGQPLPFAFDILSAAFAYGNRCFTKYPKEIPDMFKQAFPGGMSWERTMTFEDGGVASVSADISIEKDGCFKHRSKFVGVNFPVNGPVMQNKTRGWEPSIEKMTVRDGTLKGHVTMFLKLEGGGNYRCDFETTYKAKKAVKMLDSHFIEHRLVTTIRGNNVELQEDAEARNSGLGECK,alajgfp3,,504,494,,,,default,,,alajgfp3_default,,,,,,,,,,,,,,,,,,,,,,,,,,,,,,,b,,,,,,,,,,,,,,,,Q6R8F3,V25UH
d,10.1038/nbt0396-315,,,&alpha;GFP,,,,,,,MSKGEELFTGVVPILVELDGDVNGHKFSVSGEGEGDATYGKLTLKFICTTGKLPVPWPTLVTTFSYGVQCFSRYPDHMKRHDFFKSAMPEGYVQERTISFKDDGNYKTRAEVKFEGDTLVNRIELKGIDFKEDGNILGHKLEYNYNSHNVYITADKQKNGIKANFKIRHNIEDGSVQLADHYQQNTPIGDGPVLLPDNHYLSTQSALSKDPNEKRDHMVLLEFVTAAGITHGMDELYK,alphagfp,23.7,506,397,30000,,,default,,0.79,alphagfp_default,,,,,,,,,,,,,,,,,,,,,,,,,,,,,,,b,,,,,,,,,,,,,,,,,B28N7
t,10.1073/pnas.0502250102,,,amFP495,,,,,,,MALSNKFIGDDMKMTYHMDGCVNGHYFTVKGEGNGKPYEGTQTSTFKVTMANGGPLAFSFDILSTVFKYGNRCFTAYPTSMPDYFKQAFPDGMSYERTFTYEDGGVATASWEISLKGNCFEHKSTFHGVNFPADGPVMAKKTTGWDPSFEKMTVCDGILKGDVTAFLMLQGGGNYRCQFHTSYKTKKPVTMPPNHVVEHRIARTDLDKGGNSVQLTQHAVAHITSVVPF,amfp495,,495,467,,,,default,,0.08,amfp495_default,,,,,,,,,,,,,,,,,,,,,,,,,,,,,,,b,,,,,,,,,,,,,,,,,ANK6E
t,10.1073/pnas.0502250102,,,amFP506,2A48,,,,,,MALSNKFIGDDMKMTYHMDGCVNGHYFTVKGEGNGKPYEGTQTSTFKVTMANGGPLAFSFDILSTVFKYGNRCFTAYPTSMPDYFKQAFPDGMSYERTFTYEDGGVATASWEISLKGNCFEHKSTFHGVNFPADGPVMAKKTTGWDPSFQKMTVCDGILKGDVTAFLMLQGGGNYRCQFHTSYKTKKPVTMPPNHVVEHRIARTDLDKGGNSVQLTEHAVAHITSVVPF,amfp506,,506,483,,,,default,,0.67,amfp506_default,,,,,,,,,,,,,,,,,,,,,,,,,,,,,,,b,,,,,,,,,,,,,,,,,VQMW2
t,10.1073/pnas.0502250102,,,amFP515,2A47,,,,,,MALSNKFIGDDMKMTYHMDGCVNGHYFTVKGEGNGKPYEGTQTSTFKVTMANGGPLAFSFDILSTVFKYGNRCFTAYPTSMPDYFKQAFPDGMSYERTFTYEDGGVATASWEISLKGNCFEHKSTFHGVNFPADGPVMAKKTTGWDPSFEKMTVCDGILKGDVTAFLMLQGGGNYRCQFHTSYKTKKPVTMPPNHVVETRIARTDLDKGGNSVQLTEHAVAHITSVVPF,amfp515,,515,500,,,,default,,0.006,amfp515_default,,,,,,,,,,,,,,,,,,,,,,,,,,,,,,,b,,,,,,,,,,,,,,,,,8KFSR
,10.1002/jemt.20410,AAU06849,3620749,amilFP490,,,,,,,MSYSKQGIAQVMKTKYHMEGSVNGHEFTIEGVGTGNPYEGTQMSELVITKPAGKPLPFSFDILSTVFQYGNRCFTKYPEGMTDYFKQAFPDGMSFERSFLYEDGGVATASWNIRLERDCFIHKSIYHGVNFPADGPVMKKKTIGWDKAFEKMTVSKDVLRGDVTEFLMLEGGGYHSCQFHSTYKPEKPVTLPPNHVVEHHIVRTDLGQTAKGFTVKLEEHAAAHVNPLKVQ,amilfp490,26.55,490,424,29500,,,default,,0.9,amilfp490_default,,,,,,,,,,,,,,,,,,,,,,,,,,,,,,,b,,,,,,,,,,,,,,,,Q66PV5,VAXZZ
t,10.3354/meps07588,ACH89427,15616241,amilFP497,,,,,,,MSYSKQGIVQAMKTKYHMEGSVNGHEFTIEGVGTGNPYEGTQMSELVITKPAGKPLPFSFDILSTVFQYGNRCFTKYPEGMTDYFKQAFPDGMSYERSFLFEDGGVATASWNIRLEGDCFIHKSIYHGVNFPADGPVMKKKTIGWEKSFEKMTVSKDVLRGDVTMFLMLEGGGYHRCQFHSTYKPEKPGTLPPNHVVEHHIVRTDLGQSAKGFTVKLEEHAAAHVNPLKVK,amilfp497,,497,477,,,,default,,,amilfp497_default,,,,,,,,,,,,,,,,,,,,,,,,,,,,,,,b,,,,,,,,,,,,,,,,B5T1L3,VGW8W
,10.1002/jemt.20410,ABB17973,4901501,amilFP504,,,,,,,MSYSKQGIVQEMKTKYHMEGSVNGHEFTIEGVGTGYPYEGKQISELVIIKPAGKPLPFSFDILSSVFQYGNRCFTKYPADMPDYFKQAFPDGMSYERSFLFEDGAVATASWNIRLEGNCFIHKSIFHGVNFPADGPVMKKKTIDWDKSFEKMTVSKEVLRGDVTMFLMLEGGGSHRCQFHSTYKTEKPVTLPPNHVVEHQIVRTDLGQTAKGFTVKLEEHAAAHVSL,amilfp504,,504,488,,,,default,,,amilfp504_default,,,,,,,,,,,,,,,,,,,,,,,,,,,,,,,b,,,,,,,,,,,,,,,,A8CLY3,WQ5JF
t,10.3354/meps07588,ACH89428,15616242,amilFP512,,,,,,,MSYSKQGIVQEMKTKYHMEGSVNGHEFTIEGVGTGYPYEGKQMSELVIIKPAGKPLPFSFDILSSVFQYGNRCFTKYPADMPDYFKQAFPDGMSYERSFLFEDGAVATASWKIRLEGNCFIHNSIFHGVNFPADGPVMKKKTIGWDKSFEKMTVSKEVLRGDVTMFLMLEGGGSHRCQFHSTYKTEKPVTLPPNHVVEHQIVRTDLGQSAKGFTVKLEAHAAAHVNPLKVK,amilfp512,,512,500,,,,default,,,amilfp512_default,,,,,,,,,,,,,,,,,,,,,,,,,,,,,,,b,,,,,,,,,,,,,,,,B5T1L4,Q3VS4
t,10.1002/jemt.20410,AAU06846,3620747,amilFP513,,,,,,,MSYSKQGIVQEMKTKYHMEGSVNGHEFTIEGVGTGYPYEGKQMSELVIIKPAGKPLPFSFDILSSVFQYGNRCFTKYPADMPDYFKQAFPDGMSYERSFLFEDGAVATASWNIRLEGNCFIHKSIFHGVNFPADGPVMKKKTIDWDKSFEKMTVSKEVLRGDVTMFLMLEGGGSHRCQFHSTYKTEKPVTLPPNHVVEHQIVRTDLGQSAKGFTVKLEAHAAAHVNPLKVK,amilfp513,50.38,513,504,75200,,,default,,0.67,amilfp513_default,,,,,,,,,,,,,,,,,,,,,,,,,,,,,,,b,,,,,,,,,,,,,,,,Q66PV8,LO7EL
d,10.1093/molbev/msh079,AAR85350,1978515,anm1GFP1,,,,,,,MNVMRYNRGFCRVLQNGVKNLRSRNCSTEEKPVILGAMTETFQKKLPYKLELDGDVDGQTFKVIGEGVGDATTGVIEGKYVCTEGEVPISWVSLITSLSYGAKCFVRYPNEINDFFKSTFPSGYHQERKITYENDGVLETAAKITMESGAIVNRINVKGTGFDKDGHVCQKNLESSPPSTTYVVPEGEGIRIIYRNIYPTKDGHYVVADTQQVNRPIRAQGTSAIPTYHHIKSKVDLSTDPEENKDHIIIKETNCAFDADFS,anm1gfp1,48.75,495,475,75000,,,default,,0.65,anm1gfp1_default,,,,,,,,,,,,,,,,,,,,,,,,,,,,,,,b,,,,,,,,,,,,,,,,Q6RYS6,S1U3D
d,10.1093/molbev/msh079,AAR85351,1978498,anm1GFP2,,,,,,,MAEYFEKPLPYKVELEGDVDGQKFTVIGEGQGDASTGRVEGKYVCTKGEVPISWVSLITSLSYGGKCFVRYPNVIKDFFKSTFPTGYHQERKITYEDDGVLETAAKVTLESGAIYNRISVKGVGFKKDGNVCKKRLHSSPPQVSYVVPYGEGIRVLYSNIYPTKDGGYVVADTRQVNRPIKAEGKSAIPKYHYIKSKIDLSTDPNERKDHIIIKEVNVASGIDFS,anm1gfp2,,504,490,,,,default,,,anm1gfp2_default,,,,,,,,,,,,,,,,,,,,,,,,,,,,,,,b,,,,,,,,,,,,,,,,Q6RYS5,YV34T
t,10.1371/journal.pone.0002680,AAU06851,3620753,anobCFP1,,,,,,,MSYSKQGIAQVMKTKYHMEGSVNGHEFTIEGVGTGNPYEGTQMSELVITKPAGKPLPFSFDILSTVFQYGNRCFTKYPEGMTDYFKQAFPDGMSYERSFLYEDGGVATASWNIRLERDCFIHKSIYHGVNFPADGPVMKKKTIGWDKAFEKMTVSKDVLRGDVTEFLMLEGGGYHSCQFHSTYKPEKPAALPPNHVVEHHIVRTDLGQSAKGFTVKLEEHAAAHVNPLKVQ,anobcfp1,23.74,490,462,27600,,,default,,0.86,anobcfp1_default,,,,,,,,,,,,,,,,,,,,,,,,,,,,,,,b,,,,,,,,,,,,,,,,Q66PV3,NPCN7
t,10.1371/journal.pone.0002680,AAU06850,3620748,anobCFP2,,,,,,,MSYSKQGIAQVMKTKYHMEGSVNGHEFTIEGVGTGNPYEGTQMSELVITKPAGKPLPFSFDILSTVFQYGNRCFTKYPEGMTDYFKQAFPDGMSYERSFLYEDGGVATAGWNIGLERDCFIHKSIYHGVNFPADGPVMKKKTIGWDKAFEKMTVSKDVLRGDVTGFLMLEGGGYHSCQFHSTYKPEKPAALPPNHVVEHHIVRTDLGQSAKGFTVKLEEHAAAHVNPLKVQ,anobcfp2,32.93,495,477,67200,,,default,,0.49,anobcfp2_default,,,,,,,,,,,,,,,,,,,,,,,,,,,,,,,b,,,,,,,,,,,,,,,,Q66PV4,MHMQX
t,10.1371/journal.pone.0002680,AAU06847,3620741,anobGFP,,,,,,,MSYSKQGIAQEMKTKYHMEGSVNGHEFTIEGVGTGYPYEGKQMSELVIIKPAGKPLPFSFDILSSVFQYGNRCFTKYPADMPDYFKQAFPDGMSYERSFLFEDGAVATASWKIRLEGNCFIHNSIFNGVNFPADGPVMEKKTIGWDKSFEKMTVSKEVLRGDVTMFLMLEGGGSHRCQFHSTYKTEKPVTLPPNHVVEHQIVRTDLGQSAKGFTVKLEAHAAAHVNPLKVK,anobgfp,57.72,511,502,96200,,,default,,0.6,anobgfp_default,,,,,,,,,,,,,,,,,,,,,,,,,,,,,,,b,,,,,,,,,,,,,,,,Q66PV7,W1X8H
d,10.1073/pnas.97.26.14091,AAG41205,188043,asFP499,2C9I,,,,,,MYPSIKETMRVQLSMEGSVNYHAFKCTGKGEGKPYEGTQSLNITITEGGPLPFAFDILSHAFQYGIKVFAKYPKEIPDFFKQSLPGGFSWERVSTYEDGGVLSATQETSLQGDCIICKVKVLGTNFPANGPVMQKKTCGWEPSTETVIPRDGGLLLRDTPALMLADGGHLSCFMETTYKSKKEVKLPELHFHHLRMEKLNISDDWKTVEQHESVVASYSQVPSKLGHN,asfp499,,499,480,,,,default,,,asfp499_default,,,,,,,,,,,,,,,,,,,,,,,,,,,,,,,b,,,,,,,,,,,,,,,,Q9GPI6,5W398
,10.1016/s1096-4959(02)00025-8,BAM08940,27425393,atenFP,,,,,,,MRTKYHMEGSVNGHEFTIEGVGTGNPYEGTQTAELVIIKPVGKPLPFSFDILSSVFQYGNLCFTKYPADMTDYFKQAFPAGMSYERSFLFEDGAVATASWNIRLEGNCFIHNSIFHGVNFPADGPVMKKKTIGWDKSFQKMTVSKEVLRGDLAMFLLLEGGGYHRCQFHSTYKTERPVTLPPNHVVEHQIVRTDLGQSAKGFTVKLEEHAAAHVNPLKVK,atenfp,,515,504,,,,default,,,atenfp_default,,,,,,,,,,,,,,,,,,,,,,,,,,,,,,,b,,,,,,,,,,,,,,,,I0IUJ1,J9SCM
d,10.1016/0378-1119(92)90691-h,AAA27721,1266562,avGFP,1GFL,,,,,,MSKGEELFTGVVPILVELDGDVNGHKFSVSGEGEGDATYGKLTLKFICTTGKLPVPWPTLVTTFSYGVQCFSRYPDHMKQHDFFKSAMPEGYVQERTIFFKDDGNYKTRAEVKFEGDTLVNRIELKGIDFKEDGNILGHKLEYNYNSHNVYIMADKQKNGIKVNFKIRHNIEDGSVQLADHYQQNTPIGDGPVLLPDNHYLSTQSALSKDPNEKRDHMVLLEFVTAAGITHGMDELYK,avgfp,19.75,509,395,25000,,,default,4.5,0.79,avgfp_default,,,,,,,,,,,,,,,,,,,,,,,,,,,,,,,b,,,,,,,,,,,,,,,,P42212,1XF1B
,10.1515/bc.2004.038,,,avGFP509,1RMP,,,,,,,avgfp509,,509,487,,,,default,,,avgfp509_default,,,,,,,,,,,,,,,,,,,,,,,,,,,,,,,b,,,,,,,,,,,,,,,,,WL2YR
,10.1515/bc.2004.038,,,avGFP510,1RMM,,,,,,,avgfp510,,510,488,,,,default,,,avgfp510_default,,,,,,,,,,,,,,,,,,,,,,,,,,,,,,,b,,,,,,,,,,,,,,,,,PEHFX
,10.1002/cbic.200300818,,,avGFP514,,,,,,,,avgfp514,,514,484,,,,default,,,avgfp514_default,,,,,,,,,,,,,,,,,,,,,,,,,,,,,,,b,,,,,,,,,,,,,,,,,G413J
wd,10.1101/677344,,,AvicFP1,,,,,,,MSKGAELFNGIVPILIELNGDVHGHKFSVRGEGEGDAGSGKIEIKFVCTTGTLPVPWPTLVTTFCYGVQCFTRYPEHMKQHDFYKSAMPDGYIQKRTISFQDDGHYKTRAEVKFEGDTLVNRIELKGIDFKEDGNILGNKMEYNYNSHSVYVLSDKANNGIKVNFKIRHNLKGEGIQLADHDQQNIPIGDGPVLLPDYHYLSTQTAITKDPNEKRDHMNLVEFVTACGITHGMDELYK,avicfp1,40.32,503,481,64000,,,default,4.9,0.63,avicfp1_default,,,,,,,,,,,,,,,,,,,,,,,,,,,,,,,b,,,,,,,,,,,,,,,,,VE1RL
,10.1101/677344,,,AvicFP2,,,,,,,MNCGALLFKQKIPFIVELDGDVNGQVFSVRGNGFGDGSIGKIEIKFVCTTGEIPVAWESLVCSLAYGALVFTKYPSNINDFFKSTMPKGYIQERKITFENDGQYETRAEVTYENGALYNRVKLNGSGFRKDGNILGKKLDATSLGTCIYILSNDEGNGLKGVYNMAYKVIDGNRQIVSHQQTNTPIGDGLVSIPDYHVMHNHISCSKDPTEPRDHLILKESVTAVDCQTAYM,avicfp2,2.36,515,480,59000,,,pre-conversion,,0.04,avicfp2_pre-conversion,,,,41000,,,post-conversion,,0.0,avicfp2_post-conversion,,,,,,,,,,,,,,,,,,,,,b,avicfp2_pre-conversion,avicfp2_post-conversion,480,,,,,,,,,,,,,,FHG23
,10.1101/677344,,,AvicFP3,,,,,,,MNCGALLFKQKIPFIVELDGDVNGQVFSVRGNGFGDGSTGKIEIKFVCTTGEIPVAWESLVCSLAYGALVFTKYPSNINDFFKSTMPKGYIQERKITFENDGQYETRAEVTYENGALYNRVKLNGSGFRKDGNILGKKLDATSLGTCIYIMSNDQGNGLKGVYNKAYKVIGGNRQLASHQQTHTPIGDGLVSIPDYHVMHNHTSCSKDPTEPRDHLILKESVTAVDCQTAYM,avicfp3,,520,480,,,,pre-conversion,,0.001,avicfp3_pre-conversion,,,,,,,post-conversion,,,avicfp3_post-conversion,,,,,,,,,,,,,,,,,,,,,b,,,,,,,,,,,,,,,,,ZJWZK
,10.1101/677344,,,AvicFP4,,,,,,,MDSGALLFKQKIPLVVEFEGDVEGMKFSVRGKGHGDATNGRIEASFICTTGELPVPWSSIISSLTYGFLCFTKYPDGIKDFPKSAMPEGYVQERTISFENDGTYKTRAEVTFENGSVYNRVKLNGEGFNKGGNILGKKLEYSFNPHCIYVLGDKENNGIRCCFNVVHNIVGGGQLIASHSQLNTPLGGGPIAIPEYHHICNHTTLSKDPREPRDHMTVAEVLKAVDCKTAYL,avicfp4,12.1,512,500,121000,,,default,,0.1,avicfp4_default,,,,,,,,,,,,,,,,,,,,,,,,,,,,,,,b,,,,,,,,,,,,,,,,,LTRTO
t,10.1074/jbc.m304063200,BAD52001,3705446,AzamiGreen,,,,,,,MSVIKPEMKIKLCMRGTVNGHNFVIEGEGKGNPYEGTQILDLNVTEGAPLPFAYDILTTVFQYGNRAFTKYPADIQDYFKQTFPEGYHWERSMTYEDQGICTATSNISMRGDCFFYDIRFDGVNFPPNGPVMQKKTLKWEPSTEKMYVRDGVLKGDVNMALLLEGGGHYRCDFKTTYKAKKDVRLPDYHFVDHRIEILKHDKDYNKVKLYENAVARYSMLPSQAK,azamigreen,48.44,505,492,72300,,,default,5.0,0.67,azamigreen_default,,,,,,,,,,,,,,,,,,,,,,,,,,,,,,,b,,,,,,,,,,,,,,,,Q60I25,HC91W
d,10.1038/srep05469,,,bfloGFPa1,,,,,,,MPLPATHDIHLHGSINGHEFDMVGGGKGDPNAGSLVTTAKSTKGALKFSPYLMIPHLGYGYYQYLPYPDGPSPFQTSMLEGSGYAVYRVFDFEDGGKLTTEFKYSYEGSHIKADMKLMGSGFPDDGPVMTSQIVDQDGCVSKKTYLNNNTIVDSFDWSYNLQNGKRYRARVSSHYIFDKPFSADLMKKQPVFVYRKCHVKASKTEVTLDEREKAFYELA,bflogfpa1,120.9,512,500,120900,,,default,3.0,1.0,bflogfpa1_default,,,,,,,,,,,,,,,,,,,,,,,,,,,,,,,b,,,,,,,,,,,,,,,,,6BXQP
,10.1021/acs.jafc.9b05473,,,BR1,,,,,,,MIEKNYVITDPRLPDNPIIFASDGFLELTGYSREEILGRNARFLQGPETDQATVQKIRDAIRDQRETTVQLINYTKSGRKFWNLLHLQPVRDQKGELQYFIGVQLDGSDRV,br1,5.62,495,450,12500,,,BR1,,0.45,br1_br1,,,,,,,,,,,,,,,,,,,,,,,,,,,,,,,b,,,,,,,,,,,,,,,,,WH633
m,10.1038/s41598-018-31687-w,,,BrUSLEE,,,,,,,MVSKGEELFTGVVPILVELDGDVNGHKFSVSGEGEGDATYGKLTLKFICTTGKLPVPWPTLVTTLGYGVQCFSRYPDHMKQHDFFKSAMPEGYVQERTIFFKDDGNYKTRAEVKFEGDTLVNRIELKGIDFKEDGNILGHKLEYNMNSHNVYIMADKQKNGIKVNYKIRHNIEDGSVQLADHYQQNTPIGDGPVLLPDNHYLSTQSALSKDPNEKRDHMVLLEFVTAAGITLGMDELYK,bruslee,25.8,509,487,86000,0.82,,default,,0.3,bruslee_default,,,,,,,,,,,,,,,,,,,,,,,,,,,,,,,b,,,,,,,,,,,,,,,,,1K2R7
m,10.1038/nbt.1493,,,bsDronpa,,,,,,,MSVIKPDMKIKLRMEGAVNGHPFAIEGVGLGKPFEGKQSMDLKVKEGGPLPFAYDILTTAFCYGNRVFTKYPENIVDYFKQSFPEGYSWERSMNYEDGGICNATNDITLDGNCYIYEIRFDGVNFPANGPVMQKRTVKWEQSTEKLYVRDGVLKSDGNCALSLEGGGHYRCDCKTTYKAKKVVQLPDYHFVDHHIEIKSHDKDYSNVNLHEHAEAHSELPRQAK,bsdronpa,22.5,504,460,45000,,,On,,0.5,bsdronpa_on,,,,,,,Off,,,bsdronpa_off,,,,,,,,,,,,,,,,,,,,,ps,bsdronpa_off,bsdronpa_on,405,bsdronpa_on,bsdronpa_off,488,,,,,,,,,,,DOGBN
t,10.1007/s10126-007-9072-7,AAZ14788,4535146,ccalGFP1,,,,,,,MSLSKQVVKEDMKMTYHMDGCVNGHYFTIEGEGTGKPFKGQKTLKLRVTEGGPLPFAFDILSATFTYGNRCFCDYPEDMPDYFKQSLPEGYSWERTMMYEDGACGTASAHISLDKNGFVHNSTFHGVNFPANGPVMKKKGVNWEPSSEKITACDGILKGDVTMFLVLEGGHRLKCLFQTTYKADKVVKMPPNHIIEHRLVRSEDGDAVQIQEHAVAKYFTV,ccalgfp1,35.88,517,504,78000,,,default,,0.46,ccalgfp1_default,,,,,,,,,,,,,,,,,,,,,,,,,,,,,,,b,,,,,,,,,,,,,,,,Q1ALD4,T41NE
t,10.1007/s10126-007-9072-7,ABI58282,6067037,ccalGFP3,,,,,,,MSLSKQVVKQDMNMTYHMDGCVNGHSFTIEGEGRGNPFKGQQTLKLRVTKGGPLPFAFDILSATFTYGNRCFCDYPEDMPDYFKQSLPEGYSWERTMMYEDGGCGTASAHISLNKTGFVHKSTFHGVNFPANGPVMQRKTVNWEPSTEKITACDGTLKGDVTMFLLLGGGYQQKCQFQTTYRTDKTVKMPPNHIIEHRLVRSEDGDAVQIQEHAVAKYFTV,ccalgfp3,69.12,517,505,144000,,,default,,0.48,ccalgfp3_default,,,,,,,,,,,,,,,,,,,,,,,,,,,,,,,b,,,,,,,,,,,,,,,,Q09HR5,UHFSE
,10.1016/j.str.2008.10.008,,,cEGFP,3EVP,,,,,,SSLENVYIMADKQKNGIKANFKIRHNIEDGGVQLAYHYQQNTPIGDGPVLLPDNHYLSTQSKLSKDPNEKRDHMVLLEFVTAAGITLGMDELYKGGTGGSMVSKGEELFTGVVPILVELDGDVNGHKFSVSGEGEGDATYGKLTLKFICTTGKLPVPWPTLVTTLGYGVQCFSRYPDHMKQHDFFKSAMPEGYIQERTIFFKDDGNYKTRAEVKFEGDTLVNRIELKGIDFKEDGNILGHKLEYN,cegfp,,507,489,,,,default,,,cegfp_default,,,,,,,,,,,,,,,,,,,,,,,,,,,,,,,b,,,,,,,,,,,,,,,,,UNRFC
t,10.1371/journal.pone.0003766,ACH67606,15501371,cerFP505,,,,,,,MSQFPEYLPVTVHMRGNVNNLEFEYDGEGGGDPRAGQFTMNMQLRGRKPLPFSYDIITTGFQYGVRAFTKYPDSIADYFKGSFPEAFQWNRRIEFEDGGVINMSSDITFKDNRVYGDVWALGVNFPPNGPVMKNEIVMEEPAEETLIPQNGVLVGFCPKAYLLKDGSYYYGKMTTFYRSKKSGQALPGFHFIQHRLVKTKVEPGFKMVEQSEYATAFVSDLPK,cerfp505,29.7,505,494,54000,,360.0,default,,0.55,cerfp505_default,,,,,,,,,,,,,,,,,,,,,,,,,,,,,,,b,,,,,,,,,,,,,,,,B9UPG6,8XMCL
m,10.1371/journal.pone.0037551,,,cfSGFP2,,,,,,,MVSKGEELFTGVVPILVELDGDVNGHKFSVSGEGEGDATYGKLTLKFISTTGKLPVPWPTLVTTLTYGVQMFARYPDHMKQHDFFKSAMPEGYVQERTIFFKDDGNYKTRAEVKFEGDTLVNRIELKGIDFKEDGNILGHKLEYNYNSHNVYITADKQKNGIKANFKIRHNIEDGGVQLADHYQQNTPIGDGPVLLPDNHYLSTQSKLSKDPNEKRDHMVLLEFVTAAGITLGMDELYK,cfsgfp2,33.75,517,493,45000,,,default,5.4,0.75,cfsgfp2_default,,,,,,,,,,,,,,,,,,,,,,,,,,,,,,,b,,,,,,,,,,,,,,,,,YAH6C
,10.1093/nar/28.16.e78,,,CGFP,,,,,,,MSKGEELFTGVVPILVELDGDVNGHKFSVSGEGEGDATYGKLTLKFICTTGKLPVPWPTLVTTLTWGVQCFSRYPDHMKQHDFFKSAMPEGYVQERTIFFKDDGNYKTRAEVKFEGDTLVNRIELKGIDFKEDGNILGHKLEYNYNSHNVYIMADKQKNGIKVNFKIRHNIEDGSVQLADHYQQNTPIGDGPVLLPDNHYLSTQSALSKDPNEKRDHMVLLEFVTAAGITHGMDELYK,cgfp,3.35,506,463,23900,,,default,4.0,0.14,cgfp_default,,,,,,,,,,,,,,,,,,,,,,,,,,,,,,,b,,,,,,,,,,,,,,,,,5WSHL
,10.1073/pnas.062552299,AAK71342,90243,cgigGFP,,,,,,,MYPWIKETMRSKVYMEGDVNNHAFKCTAVGEGKPYKGSQDLTITVTEGGPLPFAFDILSHAFQYGNKVFTDYPDDIPDFFKQSLSDGFTWRRVSXYXXGGVLTVTQDTSLKGDCIICNIKVHGTNFPENGPVMQNKTDGWEPSSTETVIPQDGGIVAARSPALRLRDKGHLICHMETTYKPNKEVKLPELHFHHLRMEKLSVSDDGKTIKQHEYVVASYSKVPSKIGRQ,cgiggfp,,496,399,,,,default,,,cgiggfp_default,,,,,,,,,,,,,,,,,,,,,,,,,,,,,,,b,,,,,,,,,,,,,,,,Q8T5E7,UHFA9
,10.1039/c0pp00023j,ADI71929,20272185,cgreGFP,,,,,,,MTTLTEGAKLFEKEIPYITELEGDVEGMKFIIKGVGTGDATTGTIKAKYICTTGDLPVPWATILSSLSYGVFCFAKYPRHIADFFKSTQPDGYSQDRIISFDNDGQYDVKAKVTYENGTLYNRVTVKGTGFKSNGNILGMRVLYHSPPHAVYILPDRKNGGMKIEYNKAFDVMGGGHQMARHAQFNKPLGAWEEDYPLYHHLTVWTSFGKDPDDDETDHLNIVEVIKAVDLETYR,cgregfp,54.21,500,485,63030,,,default,,0.86,cgregfp_default,,,,,,,,,,,,,,,,,,,,,,,,,,,,,,,b,,,,,,,,,,,,,,,,D7PM06,ENFU4
,10.1098/rsob.130206,AEP19814,24814318,CheGFP1,,,,,,,MASAGALLLNQRVPFIMELDAEVNGIRFAVRGKGTGDATTGIIDTKFVCTTGKLPVPWASISSTMAYGALCFAKYPDSVKDFFKSAMPDGYIQEKTISFENDGAYKVRGVITYEHGSIYNRVTLKGEGFKKDGLILQKQYEFCCPNSAVYVLPDKENNGLRVVYNTIYKLKDGGHHLAAHEQQNTPLGGGVVDIPNYHHIHAGSIFSKDLEETRDHMCLVETVRAVNLETYN,chegfp1,,500,488,,,,default,,,chegfp1_default,,,,,,,,,,,,,,,,,,,,,,,,,,,,,,,b,,,,,,,,,,,,,,,,J9PGT0,63KQB
,10.1098/rsob.130206,AEP19815,24814319,CheGFP2,,,,,,,MSSTALTEGGKLFEKEIPYITELEGDVEGMKFTIKGEGTGDGTTGLIKSKYICTTGDLPVPWATILSSISYGVFCFAKYPRHIADFFKSTQPDGYSQDRIISFDDDGQYDVKAKITYEDGTLYNRVVLDGTGFKSNGNILGMRVLYHSPPHIIYILPDRKNGGMKIEYNKAFDVMGGGHQMTRHAQFNKPLGAWEEDYPMYHHLSVWTSFGKDPEDDETDHLTIVEVIKAIDLDTYK,chegfp2,,508,488,,,,default,,,chegfp2_default,,,,,,,,,,,,,,,,,,,,,,,,,,,,,,,b,,,,,,,,,,,,,,,,J9PGG2,F3LOW
,10.1098/rsob.130206,AEP19817,24814321,CheGFP4,,,,,,,MDMSSFNVGALIFNKELPFVVEVDFDIDDHKFSIRGKGVGNAEKGLMVGKYVVSEGELPCSWSAITHNFQYGQVCFTRYPKDIPDHIKSLFPEGYVQTRHSHFVDDGEYTSVHTLTYENGVIYNRVKVNGGGFKPDGNVFGKRLREVEPDICSVYFPGKDGYNCEFVKLSETVDGDYQAIRIDQVIRPLSDGPSLPMTKLYHHYKFEYSKDANETREHIIMKEQVHASHHTSK,chegfp4,,500,488,,,,default,,,chegfp4_default,,,,,,,,,,,,,,,,,,,,,,,,,,,,,,,b,,,,,,,,,,,,,,,,J9PJD5,VWLEW
wd,10.1038/nmeth.2171,AFR60231,30275454,Clover,5WJ2,,,,,,MVSKGEELFTGVVPILVELDGDVNGHKFSVRGEGEGDATNGKLTLKFICTTGKLPVPWPTLVTTFGYGVACFSRYPDHMKQHDFFKSAMPEGYVQERTISFKDDGTYKTRAEVKFEGDTLVNRIELKGIDFKEDGNILGHKLEYNFNSHNVYITADKQKNGIKANFKIRHNVEDGSVQLADHYQQNTPIGDGPVLLPDNHYLSHQSALSKDPNEKRDHMVLLEFVTAAGITHGMDELYK,clover,84.36,515,505,111000,3.2,30.0,default,6.2,0.76,clover_default,,,,,,,,,,,,,,,,,,,,,,,,,,,,,,,b,,,,,,,,,,,,,,,,,4Z641
,10.1186/1472-6750-3-5,,,cpT-Sapphire 174-173,,,,,,,,cpt-sapphire-174-173,23.32,511,399,44000,,,default,5.2,0.53,cpt-sapphire-174-173_default,,,,,,,,,,,,,,,,,,,,,,,,,,,,,,,b,,,,,,,,,,,,,,,,,AJWMF