agg,doi,genbank,ipg_id,name,pdb.0,pdb.1,pdb.2,pdb.3,pdb.4,pdb.5,seq,slug,states.0.brightness,states.0.em_max,states.0.ex_max,states.0.ext_coeff,states.0.lifetime,states.0.maturation,states.0.name,states.0.pka,states.0.qy,states.0.slug,states.1.brightness,states.1.em_max,states.1.ex_max,states.1.ext_coeff,states.1.lifetime,states.1.maturation,states.1.name,states.1.pka,states.1.qy,states.1.slug,switch_type,transitions.0.from_state,transitions.0.to_state,transitions.0.trans_wave,transitions.1.from_state,transitions.1.to_state,transitions.1.trans_wave,uniprot,uuid
,10.1002/cbic.200300818,,,(3-F)Tyr-EGFP,1RRX,,,,,,SKGEELFTGVVPILVELDGDVNGHKFSVSGEGEGDATYGKLTLKFICTTGKLPVPWPTLVTTLGYGVQCFSRYPDHMKQHDFFKSAMPEGYVQERTIFFKDDGNYKTRAEVKFEGDTLVNRIELKGIDFKEDGNILGHKLEYNYNSHNVYIMADKQKNGIKVNFKIRHNIEDGSVQLADHYQQNTPIGDGPVLLPDNHYLSTQSALSKDPNEKRDHMVLLEFVTAAGI,3-ftyr-egfp,,514,484,,,,default,,,3-ftyr-egfp_default,,,,,,,,,,,b,,,,,,,,2VPWT
t,10.1371/journal.pone.0002680,AAU06848,3620743,aacuGFP1,,,,,,,MSLSKHGITQEMPTKYHMKGSVNGHEFEIEGVGTGHPYEGTHMAELVIIKPAGKPLPFSFDILSTVIQYGNRCFTKYPADLPDYFKQAYPGGMSYERSFVYQDGGIATASWNVGLEGNCFIHKSTYLGVNFPADGPVMTKKTIGWDKAFEKMTGFNEVLRGDVTEFLMLEGGGYHSCQFHSTYKPEKPVELPPNHVIEHHIVRTDLGKTAKGFMVKLVQHAAAHVNPLKVQ,aacugfp1,22.51,502,478,36900,,,default,,0.61,aacugfp1_default,,,,,,,,,,,b,,,,,,,Q66PV6,498LC
t,10.1371/journal.pone.0002680,AAU06845,3620755,aacuGFP2,,,,,,,MSYSKQGIVQEMKTKYRMEGSVNGHEFTIEGVGTGYPYEGKQMSELVIIKPKGKPLPFSFDILSSVFQYGNRCFTKYPADMPDYFKQAFPDGMSYERSFLFEDGAVATASWNIRLEGNCFIHNSIFHGVNFPADGPVMKKKTIGWDKSFEKMTVSKEVLRGDVTMFLMLEGGGYHRCQFHSTYKTEKPVELPPNHVVEHQIVRTDLGQSAKGFTVKLEAHAAAHVNPLKVQ,aacugfp2,66.67,513,502,93900,,,default,,0.71,aacugfp2_default,,,,,,,,,,,b,,,,,,,Q66PV9,3W5ZV
m,10.1074/jbc.m109.092320,AAN41637,1780484,aceGFP,3LVA,,,,,,MSKGAELFTGIVPILIELNGDVNGHKFSVSGEGEGDATYGKLTLKFICTTGKLPVPWPTLVTTLSYGVQCFSRYPDHMKQHDFFKSAMPEGYIQERTIFFEDDGNYKSRAEVKFEGDTLVNRIELTGTDFKEDGNILGNKMEYNYNAHNVYIMTDKAKNGIKVNFKIRHNIEDGSVQLADHYQQNTPIGDGPVLLPDNHYLSTQSALSKDPNEKRDHMIYFGFVTAAAITHGMDELYK,acegfp,27.5,505,480,50000,,,default,,0.55,acegfp_default,,,,,,,,,,,b,,,,,,,Q6YGZ0,GQRF2
m,10.1074/jbc.m109.092320,,,aceGFP-G222E-Y220L,,,,,,,MSKGAELFTGIVPILIELNGDVNGHKFSVSGEGEGDATYGKLTLKFICTTGKLPVPWPTLVTTLSYGVQCFSRYPDHMKQHDFFKSAMPEGYIQERTIFFEDDGNYKSRAEVKFEGDTLVNRIELTGTDFKEDGNILGNKMEYNYNAHNVYIMTDKAKNGIKVNFKIRHNIEDGSVQLADHYQQNTPIGDGPVLLPDNHYLSTQSALSKDPNEKRDHMILFEFVTAAAITHGMDELYK,acegfp-g222e-y220l,,508,396,,,,default,,,acegfp-g222e-y220l_default,,,,,,,,,,,b,,,,,,,,DH5VX
,10.1042/bj20021966,AAP69597,1780523,aceGFP-h,,,,,,,SKGAELFTGIVPILIELNGDVNGHKFSVSGEGEGDATYGKLTLKFICTTGKLPVPWPTLVTTLSYGVQCFSRYPDHMKQHDFFKSAMPEGYIQERTIFFEDDGNYKSRAEVKFEGDTLVNRIELTGTDFKEDGNILGNKMEYNYNAHNVYIMTDKAKNGIKVNFKIRHNIEDGSVQLADHYQQNTPIGDGPVLLPDNHYLSTQSALSKDPNEKRDHMIYFGFVTAAAITHGMDELYK,acegfp-h,,505,390,,,,default,,,acegfp-h_default,,,,,,,,,,,b,,,,,,,,WBLSA
wd,,,,AcGFP1,,,,,,,MVSKGAELFTGIVPILIELNGDVNGHKFSVSGEGEGDATYGKLTLKFICTTGKLPVPWPTLVTTLSYGVQCFSRYPDHMKQHDFFKSAMPEGYIQERTIFFEDDGNYKSRAEVKFEGDTLVNRIELTGTDFKEDGNILGNKMEYNYNAHNVYIMTDKAKNGIKVNFKIRHNIEDGSVQLADHYQQNTPIGDGPVLLPDNHYLSTQSALSKDPNEKRDHMIYFGFVTAAAITHGMDELYK,acgfp1,27.5,505,475,50000,,,default,,0.55,acgfp1_default,,,,,,,,,,,b,,,,,,,,6ORKJ
t,10.1371/journal.pone.0002680,ACD13192,14926073,aeurGFP,,,,,,,MSYSKQGIVQEMKTKYHMEGSVNGHEFTIEGVATGYPYEGKQMSELVIIKPKGKPLPFSFDILSSVFQYGNRCFTKYPADIPDYFKQAFPDGMSYERSFLFEDGAVATASWNIRLEGNCFIHNSIFHGVNFPADGPVMKKQTIGWDKSFEKMTVSKEVLRGDVTMFLMLEGGGYHRCQFHSTYKTEKPVTLPPNHVVEHQIVRTDLGQSAKGFTVKLEALAAAHVNPLKVQ,aeurgfp,97.62,515,504,145700,,,default,,0.67,aeurgfp_default,,,,,,,,,,,b,,,,,,,B6CTZ3,4NRYW
t,10.1371/journal.pone.0002680,AAU06857,3620756,afraGFP,,,,,,,MSVIVKEMMTKLHMEGTVNGHAFTIEGKGKGDPYNGVQSMNLDVKGGAPLPFSFDLLTPAFMYGNRVFTKYPEDIPDFFKQVFPEGYHWERSITFEDQAVCTATSHIRLDQKEMCFIYDVRFHGVNFPANGPIMQKKILGWEPSTEKMYARDGVLKGDVNMTLRVEGGGHYRADFRTTYKAKKPVNLPGYHFIDHRIEITKHSKDYTNVALYEAAVARHSPLPKVA,afragfp,61.49,503,494,100800,,,default,,0.61,afragfp_default,,,,,,,,,,,b,,,,,,,Q66PU5,T5A9C
t,10.1021/bp034308g,AAS18270,2033734,alajGFP1,,,,,,,MSLSKQVIGKEMNMTYLMDGSVNGHNFTVEGEGDGKPYEGHQCLKLRITKGEPLPFAFDILTAAFCYGNRCFVNYPAEIADYFKQAFPEGLTWERSMTFEDGGFAAVSADISLNGNCFVHQSKFVGVNFPADGPVMQKKTVGWEPSTEKMIVRDGILEGDVTMYLKLEGGGNYRCEYRTIYKAKKDVKMPKSHFVEHTLVRNNIKKDAKGNTIELIEDASARY,alajgfp1,,517,509,,,,default,,,alajgfp1_default,,,,,,,,,,,b,,,,,,,Q6R8F5,LBAXM
t,10.1021/bp034308g,AAS18271,2033714,alajGFP2,,,,,,,MVLSKQMNMTYLMDGSVNGHNFTVEGEGDGKPYEGHQCLKLRITKGEPLPFAFDILTAAFCYGNRCFVNYPAEIADYFKQAFPEGLTWERSMTFEDGGFAAVSADLSLKNGNWFVHQSKFVGVNFPADGPVMQKKTVGWEPSTEKMIVRDGTLEGDVTMYLKLEGGGNYRCDYRTIYKAKKDVKMPKSHFVEHTLVRNNIKKDAKGNTIELIEDASARY,alajgfp2,,517,509,,,,default,,,alajgfp2_default,,,,,,,,,,,b,,,,,,,Q6R8F4,RFJ23
t,10.1021/bp034308g,AAS18272,2033751,alajGFP3,,,,,,,MALSKQEIKKEMTMDYVMDGCVNGHSFTVKGDGAGKPYEGHQRLSLHVTGGQPLPFAFDILSAAFAYGNRCFTKYPKEIPDMFKQAFPGGMSWERTMTFEDGGVASVSADISIEKDGCFKHRSKFVGVNFPVNGPVMQNKTRGWEPSIEKMTVRDGTLKGHVTMFLKLEGGGNYRCDFETTYKAKKAVKMLDSHFIEHRLVTTIRGNNVELQEDAEARNSGLGECK,alajgfp3,,504,494,,,,default,,,alajgfp3_default,,,,,,,,,,,b,,,,,,,Q6R8F3,V25UH
d,10.1038/nbt0396-315,,,&alpha;GFP,,,,,,,MSKGEELFTGVVPILVELDGDVNGHKFSVSGEGEGDATYGKLTLKFICTTGKLPVPWPTLVTTFSYGVQCFSRYPDHMKRHDFFKSAMPEGYVQERTISFKDDGNYKTRAEVKFEGDTLVNRIELKGIDFKEDGNILGHKLEYNYNSHNVYITADKQKNGIKANFKIRHNIEDGSVQLADHYQQNTPIGDGPVLLPDNHYLSTQSALSKDPNEKRDHMVLLEFVTAAGITHGMDELYK,alphagfp,23.7,506,397,30000,,,default,,0.79,alphagfp_default,,,,,,,,,,,b,,,,,,,,B28N7
t,10.1038/13657,AAF03371,1173879,amFP486,2A46,,,,,,MALSNKFIGDDMKMTYHMDGCVNGHYFTVKGEGNGKPYEGTQTSTFKVTMANGGPLAFSFDILSTVFKYGNRCFTAYPTSMPDYFKQAFPDGMSYERTFTYEDGGVATASWEISLKGNCFEHKSTFHGVNFPADGPVMAKKTTGWDPSFEKMTVCDGILKGDVTAFLMLQGGGNYRCQFHTSYKTKKPVTMPPNHVVEHRIARTDLDKGGNSVQLTEHAVAHITSVVPF,amfp486,9.6,486,458,40000,,,default,,0.24,amfp486_default,,,,,,,,,,,b,,,,,,,Q9U6Y6,1M48O
t,10.1002/jemt.20410,AAU06846,3620747,amilFP513,,,,,,,MSYSKQGIVQEMKTKYHMEGSVNGHEFTIEGVGTGYPYEGKQMSELVIIKPAGKPLPFSFDILSSVFQYGNRCFTKYPADMPDYFKQAFPDGMSYERSFLFEDGAVATASWNIRLEGNCFIHKSIFHGVNFPADGPVMKKKTIDWDKSFEKMTVSKEVLRGDVTMFLMLEGGGSHRCQFHSTYKTEKPVTLPPNHVVEHQIVRTDLGQSAKGFTVKLEAHAAAHVNPLKVK,amilfp513,50.38,513,504,75200,,,default,,0.67,amilfp513_default,,,,,,,,,,,b,,,,,,,Q66PV8,LO7EL
d,10.1093/molbev/msh079,AAR85350,1978515,anm1GFP1,,,,,,,MNVMRYNRGFCRVLQNGVKNLRSRNCSTEEKPVILGAMTETFQKKLPYKLELDGDVDGQTFKVIGEGVGDATTGVIEGKYVCTEGEVPISWVSLITSLSYGAKCFVRYPNEINDFFKSTFPSGYHQERKITYENDGVLETAAKITMESGAIVNRINVKGTGFDKDGHVCQKNLESSPPSTTYVVPEGEGIRIIYRNIYPTKDGHYVVADTQQVNRPIRAQGTSAIPTYHHIKSKVDLSTDPEENKDHIIIKETNCAFDADFS,anm1gfp1,48.75,495,475,75000,,,default,,0.65,anm1gfp1_default,,,,,,,,,,,b,,,,,,,Q6RYS6,S1U3D
d,10.1093/molbev/msh079,AAR85351,1978498,anm1GFP2,,,,,,,MAEYFEKPLPYKVELEGDVDGQKFTVIGEGQGDASTGRVEGKYVCTKGEVPISWVSLITSLSYGGKCFVRYPNVIKDFFKSTFPTGYHQERKITYEDDGVLETAAKVTLESGAIYNRISVKGVGFKKDGNVCKKRLHSSPPQVSYVVPYGEGIRVLYSNIYPTKDGGYVVADTRQVNRPIKAEGKSAIPKYHYIKSKIDLSTDPNERKDHIIIKEVNVASGIDFS,anm1gfp2,,504,490,,,,default,,,anm1gfp2_default,,,,,,,,,,,b,,,,,,,Q6RYS5,YV34T
t,10.1371/journal.pone.0002680,AAU06847,3620741,anobGFP,,,,,,,MSYSKQGIAQEMKTKYHMEGSVNGHEFTIEGVGTGYPYEGKQMSELVIIKPAGKPLPFSFDILSSVFQYGNRCFTKYPADMPDYFKQAFPDGMSYERSFLFEDGAVATASWKIRLEGNCFIHNSIFNGVNFPADGPVMEKKTIGWDKSFEKMTVSKEVLRGDVTMFLMLEGGGSHRCQFHSTYKTEKPVTLPPNHVVEHQIVRTDLGQSAKGFTVKLEAHAAAHVNPLKVK,anobgfp,57.72,511,502,96200,,,default,,0.6,anobgfp_default,,,,,,,,,,,b,,,,,,,Q66PV7,W1X8H
d,10.1073/pnas.97.26.14091,AAG41205,188043,asFP499,2C9I,,,,,,MYPSIKETMRVQLSMEGSVNYHAFKCTGKGEGKPYEGTQSLNITITEGGPLPFAFDILSHAFQYGIKVFAKYPKEIPDFFKQSLPGGFSWERVSTYEDGGVLSATQETSLQGDCIICKVKVLGTNFPANGPVMQKKTCGWEPSTETVIPRDGGLLLRDTPALMLADGGHLSCFMETTYKSKKEVKLPELHFHHLRMEKLNISDDWKTVEQHESVVASYSQVPSKLGHN,asfp499,,499,480,,,,default,,,asfp499_default,,,,,,,,,,,b,,,,,,,Q9GPI6,5W398
d,10.1016/0378-1119(92)90691-h,AAA27721,1266562,avGFP,1GFL,,,,,,MSKGEELFTGVVPILVELDGDVNGHKFSVSGEGEGDATYGKLTLKFICTTGKLPVPWPTLVTTFSYGVQCFSRYPDHMKQHDFFKSAMPEGYVQERTIFFKDDGNYKTRAEVKFEGDTLVNRIELKGIDFKEDGNILGHKLEYNYNSHNVYIMADKQKNGIKVNFKIRHNIEDGSVQLADHYQQNTPIGDGPVLLPDNHYLSTQSALSKDPNEKRDHMVLLEFVTAAGITHGMDELYK,avgfp,19.75,509,395,25000,,,default,4.5,0.79,avgfp_default,,,,,,,,,,,b,,,,,,,P42212,1XF1B
,10.1016/j.bbrc.2005.04.166,,,avGFP454,,,,,,,MSKGEELFTGVVPILVELDGDVNGHKFSVSGEGEGDATYGKLTLKFICTTGKLPVPWPTLVTTFSYAVQCFSRYPDHMKQHDFFKSAMPEGYVQERTIFFKDDGNYKTRAEVKFEGDTLVNRIELKGIDFKEDGNILGHKLEYNYNSHNVYIMADKQKNGIKVNFKIRHNIEDGSVQLADHYQQNTPIGDGPVLLPDNHYLSTQSALSKDPNEKRDHMVLLEFVTAAGITHGMDELYK,avgfp454,,454,410,,,,default,,,avgfp454_default,,,,,,,,,,,b,,,,,,,,T4B2J
,10.1515/bc.2004.038,,,avGFP480,1RM9,,,,,,VSKGEELFTGVVPILVELDGDVNGHKFSVSGEGEGDATYGKLTLKFICTTGKLPVPWPTLVTTLGYGVQCFSRYPDHMKRHDFFKSAMPEGYVQERTIFFKDDGNYKTRAEVKFEGDTLVNRIELKGIDFKEDGNILGHKLEYNYISHNVYITADKQKNGIKANFKIRHNIEDGSVQLADHYQQNTPIGDGPVLLPDNHYLSTQSALSKDPNEKRDHMVLLEFVTAAGITLGMDELYK,avgfp480,,480,456,,,,default,,,avgfp480_default,,,,,,,,,,,b,,,,,,,,QPRJJ
,10.1515/bc.2004.038,,,avGFP509,1RMP,,,,,,,avgfp509,,509,487,,,,default,,,avgfp509_default,,,,,,,,,,,b,,,,,,,,WL2YR
,10.1515/bc.2004.038,,,avGFP510,1RMM,,,,,,,avgfp510,,510,488,,,,default,,,avgfp510_default,,,,,,,,,,,b,,,,,,,,PEHFX
,10.1002/cbic.200300818,,,avGFP514,,,,,,,,avgfp514,,514,484,,,,default,,,avgfp514_default,,,,,,,,,,,b,,,,,,,,G413J
,10.1093/emboj/20.21.5853,,,avGFP523,1H6R,,,,,,,avgfp523,,523,512,,,,default,6.05,,avgfp523_default,,,,,,,,,,,b,,,,,,,,WPR7G
d,10.1038/srep05469,,,bfloGFPa1,,,,,,,MPLPATHDIHLHGSINGHEFDMVGGGKGDPNAGSLVTTAKSTKGALKFSPYLMIPHLGYGYYQYLPYPDGPSPFQTSMLEGSGYAVYRVFDFEDGGKLTTEFKYSYEGSHIKADMKLMGSGFPDDGPVMTSQIVDQDGCVSKKTYLNNNTIVDSFDWSYNLQNGKRYRARVSSHYIFDKPFSADLMKKQPVFVYRKCHVKASKTEVTLDEREKAFYELA,bflogfpa1,120.9,512,500,120900,,,default,3.0,1.0,bflogfpa1_default,,,,,,,,,,,b,,,,,,,,6BXQP
d,10.1038/srep05469,,,bfloGFPc1,4DKM,,,,,,LPTTHEVHVYGSINGVEFDLVGSGKGNPKDGSEEIQVKSTKGPLGFSPYIVVPNIGYGFHQYLPFPDGMSPFQAAADDGSGYVVHRTIQFEDGASLTGNYRYSYDGGHIKGEFHVVGSGFPADGPVMTKSLTAVDWSVATMLFPNDTTVVSTIDWTCPTTSGKRYHATLRTNYTFAKPIAATILQKQPMFVFRKTEVKASDAEINLKEWQKAFHDL,bflogfpc1,0.15,521,493,98800,,,default,,0.0015,bflogfpc1_default,,,,,,,,,,,b,,,,,,,,7AJCQ
t,10.1007/s10126-007-9072-7,AAZ14788,4535146,ccalGFP1,,,,,,,MSLSKQVVKEDMKMTYHMDGCVNGHYFTIEGEGTGKPFKGQKTLKLRVTEGGPLPFAFDILSATFTYGNRCFCDYPEDMPDYFKQSLPEGYSWERTMMYEDGACGTASAHISLDKNGFVHNSTFHGVNFPANGPVMKKKGVNWEPSSEKITACDGILKGDVTMFLVLEGGHRLKCLFQTTYKADKVVKMPPNHIIEHRLVRSEDGDAVQIQEHAVAKYFTV,ccalgfp1,35.88,517,504,78000,,,default,,0.46,ccalgfp1_default,,,,,,,,,,,b,,,,,,,Q1ALD4,T41NE
t,10.1007/s10126-007-9072-7,ABI58282,6067037,ccalGFP3,,,,,,,MSLSKQVVKQDMNMTYHMDGCVNGHSFTIEGEGRGNPFKGQQTLKLRVTKGGPLPFAFDILSATFTYGNRCFCDYPEDMPDYFKQSLPEGYSWERTMMYEDGGCGTASAHISLNKTGFVHKSTFHGVNFPANGPVMQRKTVNWEPSTEKITACDGTLKGDVTMFLLLGGGYQQKCQFQTTYRTDKTVKMPPNHIIEHRLVRSEDGDAVQIQEHAVAKYFTV,ccalgfp3,69.12,517,505,144000,,,default,,0.48,ccalgfp3_default,,,,,,,,,,,b,,,,,,,Q09HR5,UHFSE
,10.1016/j.str.2008.10.008,,,cEGFP,3EVP,,,,,,SSLENVYIMADKQKNGIKANFKIRHNIEDGGVQLAYHYQQNTPIGDGPVLLPDNHYLSTQSKLSKDPNEKRDHMVLLEFVTAAGITLGMDELYKGGTGGSMVSKGEELFTGVVPILVELDGDVNGHKFSVSGEGEGDATYGKLTLKFICTTGKLPVPWPTLVTTLGYGVQCFSRYPDHMKQHDFFKSAMPEGYIQERTIFFKDDGNYKTRAEVKFEGDTLVNRIELKGIDFKEDGNILGHKLEYN,cegfp,,507,489,,,,default,,,cegfp_default,,,,,,,,,,,b,,,,,,,,UNRFC
t,10.1038/13657,AAF03374,910533,cFP484,,,,,,,MKCKFVFCLSFLVLAITNANIFLRNEADLEEKTLRIPKALTTMGVIKPDMKIKLKMEGNVNGHAFVIEGEGEGKPYDGTHTLNLEVKEGAPLPFSYDILSNAFQYGNRALTKYPDDIADYFKQSFPEGYSWERTMTFEDKGIVKVKSDISMEEDSFIYEIRFDGMNFPPNGPVMQKKTLKWEPSTEIMYVRDGVLVGDISHSLLLEGGGHYRCDFKSIYKAKKVVKLPDYHFVDHRIEILNHDKDYNKVTLYENAVARYSLLPSQA,cfp484,16.94,484,456,35300,,,default,,0.48,cfp484_default,,,,,,,,,,,b,,,,,,,Q9U6Y3,O8SH6
m,10.1371/journal.pone.0037551,,,cfSGFP2,,,,,,,MVSKGEELFTGVVPILVELDGDVNGHKFSVSGEGEGDATYGKLTLKFISTTGKLPVPWPTLVTTLTYGVQMFARYPDHMKQHDFFKSAMPEGYVQERTIFFKDDGNYKTRAEVKFEGDTLVNRIELKGIDFKEDGNILGHKLEYNYNSHNVYITADKQKNGIKANFKIRHNIEDGGVQLADHYQQNTPIGDGPVLLPDNHYLSTQSKLSKDPNEKRDHMVLLEFVTAAGITLGMDELYK,cfsgfp2,33.75,517,493,45000,,,default,5.4,0.75,cfsgfp2_default,,,,,,,,,,,b,,,,,,,,YAH6C
,10.1093/nar/28.16.e78,,,CGFP,,,,,,,MSKGEELFTGVVPILVELDGDVNGHKFSVSGEGEGDATYGKLTLKFICTTGKLPVPWPTLVTTLTWGVQCFSRYPDHMKQHDFFKSAMPEGYVQERTIFFKDDGNYKTRAEVKFEGDTLVNRIELKGIDFKEDGNILGHKLEYNYNSHNVYIMADKQKNGIKVNFKIRHNIEDGSVQLADHYQQNTPIGDGPVLLPDNHYLSTQSALSKDPNEKRDHMVLLEFVTAAGITHGMDELYK,cgfp,3.35,506,463,23900,,,default,4.0,0.14,cgfp_default,,,,,,,,,,,b,,,,,,,,5WSHL
,10.1073/pnas.062552299,AAK71342,90243,cgigGFP,,,,,,,MYPWIKETMRSKVYMEGDVNNHAFKCTAVGEGKPYKGSQDLTITVTEGGPLPFAFDILSHAFQYGNKVFTDYPDDIPDFFKQSLSDGFTWRRVSXYXXGGVLTVTQDTSLKGDCIICNIKVHGTNFPENGPVMQNKTDGWEPSSTETVIPQDGGIVAARSPALRLRDKGHLICHMETTYKPNKEVKLPELHFHHLRMEKLSVSDDGKTIKQHEYVVASYSKVPSKIGRQ,cgiggfp,,496,399,,,,default,,,cgiggfp_default,,,,,,,,,,,b,,,,,,,Q8T5E7,UHFA9
,10.1039/c0pp00023j,ADI71929,20272185,cgreGFP,,,,,,,MTTLTEGAKLFEKEIPYITELEGDVEGMKFIIKGVGTGDATTGTIKAKYICTTGDLPVPWATILSSLSYGVFCFAKYPRHIADFFKSTQPDGYSQDRIISFDNDGQYDVKAKVTYENGTLYNRVTVKGTGFKSNGNILGMRVLYHSPPHAVYILPDRKNGGMKIEYNKAFDVMGGGHQMARHAQFNKPLGAWEEDYPLYHHLTVWTSFGKDPDDDETDHLNIVEVIKAVDLETYR,cgregfp,54.21,500,485,63030,,,default,,0.86,cgregfp_default,,,,,,,,,,,b,,,,,,,D7PM06,ENFU4
,10.1098/rsob.130206,AEP19814,24814318,CheGFP1,,,,,,,MASAGALLLNQRVPFIMELDAEVNGIRFAVRGKGTGDATTGIIDTKFVCTTGKLPVPWASISSTMAYGALCFAKYPDSVKDFFKSAMPDGYIQEKTISFENDGAYKVRGVITYEHGSIYNRVTLKGEGFKKDGLILQKQYEFCCPNSAVYVLPDKENNGLRVVYNTIYKLKDGGHHLAAHEQQNTPLGGGVVDIPNYHHIHAGSIFSKDLEETRDHMCLVETVRAVNLETYN,chegfp1,,500,488,,,,default,,,chegfp1_default,,,,,,,,,,,b,,,,,,,J9PGT0,63KQB
,10.1098/rsob.130206,AEP19815,24814319,CheGFP2,,,,,,,MSSTALTEGGKLFEKEIPYITELEGDVEGMKFTIKGEGTGDGTTGLIKSKYICTTGDLPVPWATILSSISYGVFCFAKYPRHIADFFKSTQPDGYSQDRIISFDDDGQYDVKAKITYEDGTLYNRVVLDGTGFKSNGNILGMRVLYHSPPHIIYILPDRKNGGMKIEYNKAFDVMGGGHQMTRHAQFNKPLGAWEEDYPMYHHLSVWTSFGKDPEDDETDHLTIVEVIKAIDLDTYK,chegfp2,,508,488,,,,default,,,chegfp2_default,,,,,,,,,,,b,,,,,,,J9PGG2,F3LOW
,10.1098/rsob.130206,AEP19816,24814320,CheGFP3,,,,,,,MDMANMNVGAMLFNKELPFVCELDGEINGHKFSVRGKGIGNSAQGLTHGIHVCTSGELPVSWTAITHNLQYGLLCFSQYPHDINDYIKSTFPEGYTKERTSNFDGDGKYTSRHVITYENGCIYNRVTINGSGFSDDGNVLGKNLADYEKPVCSMYFPGKDGLRAEICKLTETKDGGYQSCRLEDQVIRPISQGPTVPMTHHYNYSSVEYSKDANETRDHIVMKEITKVSHFIQ,chegfp3,,,,,,,,,,,,,,,,,,,,,,,,,,,,J9PIH6,6Z58E
,10.1098/rsob.130206,AEP19817,24814321,CheGFP4,,,,,,,MDMSSFNVGALIFNKELPFVVEVDFDIDDHKFSIRGKGVGNAEKGLMVGKYVVSEGELPCSWSAITHNFQYGQVCFTRYPKDIPDHIKSLFPEGYVQTRHSHFVDDGEYTSVHTLTYENGVIYNRVKVNGGGFKPDGNVFGKRLREVEPDICSVYFPGKDGYNCEFVKLSETVDGDYQAIRIDQVIRPLSDGPSLPMTKLYHHYKFEYSKDANETREHIIMKEQVHASHHTSK,chegfp4,,500,488,,,,default,,,chegfp4_default,,,,,,,,,,,b,,,,,,,J9PJD5,VWLEW
,10.1021/bi026609p,,,deGFP1,1JBZ,1JBY,,,,,MSKGEELFTGVVPILVELDGDVNGHKFSVSGEGEGDATYGKLTLKFICTTGKLPVPWPTLVTTFTYGVQCFSRYPDHMKRHDFFKSAMPEGYVQERTIFFKDDGNYKTRAEVKFEGDTLVNRIELKGIDFKEDGNILGHKLEYNYNSGNVYIMADKQKNGIKVNFKIRHNIEDGSVQLADHYQQNTPIGDGPVLLPDNHYLSCQSALSKDPNEKRDHMVLLEFVTAAGITHGMDELYK,degfp1,4.59,516,504,28700,,,default,8.02,0.16,degfp1_default,,,,,,,,,,,b,,,,,,,,THWKH
,10.1021/bi026609p,,,deGFP2,,,,,,,MSKGEELFTGVVPILVELDGDVNGHKFSVSGEGEGDATYGKLTLKFISTTGKLPVPWPTLVTTFTYGVQCFSRYPDHMKQHDFFKSAMPEGYVQERTIFFKDDGNYKTRAEVKFEGDTLVNRIELKGIDFKEDGNILGHKLEYNYNSCNVYIMADKQKNGIKVNFKIRHNIEDGSVQLADHYQQNTPIGDGPVLLPDNHYLSTQSALSKDPNEKRDHMVLLEFVTAAGITHGMDELYK,degfp2,7.38,517,496,21700,,,default,7.25,0.34,degfp2_default,,,,,,,,,,,b,,,,,,,,MGNCD
,10.1021/bi026609p,,,deGFP3,,,,,,,MSKGEELFTGVVPILVELDGDVNGHKFSVSGEGEGDATYGKLTLKFICTTGKLPVPWPTLVTTFTYGVQCFSRYPDHMKQHDFFKSAMPEGYVQERTIFFKDDGNYKTRAEVKFEGDTLVNRIELKGIDFKEDGNILGHKLEYNYNSHNVYIMADKQKNGIKVNFKIRHNIEDGSVQLADHYQQNTPIGDGPVLLPDNHYLSCQSALSKDPNEKRDHMVLLEFVTAAGITHGMDELYK,degfp3,5.07,518,508,26700,,,default,6.86,0.19,degfp3_default,,,,,,,,,,,b,,,,,,,,B72B1
,10.1021/bi026609p,,,deGFP4,,,,,,,MSKGEELFTGVVPILVELDGDVNGHKFSVSGEGEGDATYGKLTLKFISTTGKLPVPWPTLVTTFTYGVQCFSRYPDHMKQHDFFKSAMPEGYVQERTIFFKDDGNYKTRAEVKFEGDTLVNRIELKGIDFKEDGNILGHKLEYNYNSCNVYIMADKQKNGIKVNFKIRHNIEDGSVQLADHYQQNTPIGDGPVLLPDNHYLSCQSALSKDPNEKRDHMVLLEFVTAAGITHGMDELYK,degfp4,4.04,518,509,26900,,,default,7.37,0.15,degfp4_default,,,,,,,,,,,b,,,,,,,,LDZC9
t,10.1073/pnas.062552299,AAM10625,4560782,dendFP,,,,,,,MNLIKEDMRVKVHMEGNVNGHAFVIEGEGKGKPYEGTQTLNLTVKEGAPLPFSYDILTTALHYGNRVFTKYPEDIPDYFKQSFPEGYSWERTMTYEDKGICTIRSDISLEGDCFFQNVRFNGMNFPPNGPVMQKKTLKWEPSTEKLHVRDGLLVGNINMALLLEGGGHYLCDFKTTYKAKKVVQLPDYHFVDHRIEILSNDSDYNKVKLYEHGVARYSPLPSQAW,dendfp,58.5,508,492,90000,,,Green,6.5,0.65,dendfp_green,23.8,575,557,35000,,,Red,5.2,0.68,dendfp_red,pc,dendfp_green,dendfp_red,405,,,,Q8T6U0,JTXCJ
d,10.1016/j.chembiol.2017.12.005,BBC28143,,dfGFP,,,,,,,MASGRALFQYPMTSKIELNGEINGKKFKVAGEGFTPNSGRFNMHAYCTTGDLPMSWVVIASPLQYGFHMFAHYPEDITHFFQECFPGSYTLDRTLRMEGDGTLTTHHEYSLKDGCVTSKTTLNASGFDPKGATMTKSFVEQLPNQVEIFAEGNGIRLLSHVPYLKKDGTIQIGYQDCIVKPVGGKKVTQPKYHFLHTQIIQKKDPNDTRDHIVQTELAVAGNPWHEPSASAV,dfgfp,,524,505,,,,default,3.8,,dfgfp_default,,,,,,,,,,,b,,,,,,,,P2PV8
,10.1371/journal.pone.0002680,ABB17972,4901548,dhorGFP,,,,,,,MSYSKQGIVQEMKTKYRMEGSVNGHEFTIEGVGTGYPYEGKQMSELVIIKPKGKPLPFSFDILSSVFQYGNRCFTKYPADMPDYFKQAFPDGMSYERSFLFEDGAVATASWNIRLEGNCFIHNSIFHGVNFPADGPVMKKKTIGWDKSFEKMTVSKEVLTGDVTMFLMLEGGGYHRCQFHSTYKTEKPVELPPNHVVEHQIVRTDLGQSAKGFTVKLEAHAAAHVNPLKVQ,dhorgfp,,,,,,,,,,,,,,,,,,,,,,,,,,,,A8CLX9,U7WYN
,10.1073/pnas.062552299,AAM10627,1067021,dis3GFP,,,,,,,MSALKEEMKINLTMEGVVNGLPFKIRGDGKGKPYQGSQELTLTVVKGGPLPFSYDILTTMFQYGNRAFVNYPEDIPDIFKQTCSGPNGGYSWQRTMTYEDGGVCTATSNISVVGDTFNYDIHFMGANFPLDGPVMQKRTMKWEPSTEIMFERDGMLRGDIAMSLLLKGGGHYRCDFETIYKPNKVVKMPDYHFVDHCIEITSQQDYYNVVELTEVAEARYSSLEKIGKSKA,dis3gfp,,512,503,,,,default,,,dis3gfp_default,,,,,,,,,,,b,,,,,,,Q8T6T8,D41LA
t,10.1371/journal.pone.0002680,ABB17956,4901576,eechGFP1,,,,,,,MSVINPDMKIKLYMEGAVNGHKFEIKGEGNGKPFEGKQTMDLAVVDGGPLPFAFDILTTSFNYGNRVFTKYPDTIVDYFKPSFPEGYSWERSMTYEDGGICIATNDITLLKDTDDSNYFYYKIRFDGVNFAANGPVMQKKTAKWEPSTEKMYVRDGVLKGEVNMALLLEGGGHYRCDFKTTYKAKKVVRLPSYHFVDHRIEILSHSKDYNQVRLHEHAEAHSGLPRQAK,eechgfp1,93.15,510,497,124200,,,default,,0.75,eechgfp1_default,,,,,,,,,,,b,,,,,,,A8CLQ1,MX4SD
t,10.1371/journal.pone.0002680,ABB17968,4901521,eechGFP2,,,,,,,MNVIKPDMKIKLRMEGAVNGHKFAIEGEGNGQPFEGKQTMNLKVKEGGPLPFAYDILTTIFNYGNRVFVKYPDDIVDYFKQSFPEGYSWERSMIYEDGGICIATNDITLEGDCFVYKIRFDGVNFPAKSPVLQKMTKKWEPSTEKLYVRDGVLKGDVNMALLLEGGGHFRCDFKTTYKAKKVVQLPDYHFVDHRIEIMSHDKDYNNVKLCEHAEAHSGLPGQAK,eechgfp2,75.76,520,506,109800,,,default,,0.69,eechgfp2_default,,,,,,,,,,,b,,,,,,,A8CLW1,37XMD
t,10.1371/journal.pone.0002680,ABB17969,4901511,eechGFP3,,,,,,,MNVIKPDMKIRLRMEGAVNGHKFVIIGKGDGKPYEGTQTMDLEVIEGGPLPFAFDILTTVFKYGNRAFVKYPTDIADYFKQSFPEGFSWERSMTYEDGGICIATNDITLSKDIANCFDYNIRFDGVNFPPNSPVLQKTTIKWEPSTENMYVRDGVLKGDINMSLLLEGGAGHYRCDFKTTYKAKKAVKLPDYHFVDHRITIVSHDKDYNKVKLREHAEAHSGLQMEAK,eechgfp3,54.27,524,512,120600,,,default,,0.45,eechgfp3_default,,,,,,,,,,,b,,,,,,,A8CLW4,31NFQ
t,10.1371/journal.pone.0002680,ABB17958,4901483,efasGFP,,,,,,,MALSKQGIQTDMKMTYSMEGCVNGHNFTVKGGGDGNPYEGHQELRLCITMAKGEPVPFAFDILSAAFCYGNRCFTKYPDEIRDYFKQAFPGGLSWERSMAFEDGASAAVTAEISLEGDCFEHECEFVGVNFPANGPVMQKKTQGWETSTEKMTAHGKVVQGNVPMFLKLEGGGRHRCDFRTTYKAKKDVKMPNSHFITHCLVRKGDGNNTELIEDAEARN,efasgfp,100.64,507,496,125800,,,default,,0.8,efasgfp_default,,,,,,,,,,,b,,,,,,,A8CLR1,5EU5J
wd,10.1016/0378-1119(95)00685-0,AAB02572,928978,EGFP,2Y0G,4EUL,,,,,MVSKGEELFTGVVPILVELDGDVNGHKFSVSGEGEGDATYGKLTLKFICTTGKLPVPWPTLVTTLTYGVQCFSRYPDHMKQHDFFKSAMPEGYVQERTIFFKDDGNYKTRAEVKFEGDTLVNRIELKGIDFKEDGNILGHKLEYNYNSHNVYIMADKQKNGIKVNFKIRHNIEDGSVQLADHYQQNTPIGDGPVLLPDNHYLSTQSALSKDPNEKRDHMVLLEFVTAAGITLGMDELYK,egfp,33.54,507,488,55900,2.6,25.0,default,6.0,0.6,egfp_default,,,,,,,,,,,b,,,,,,,C5MKY7,R9NL8
d,10.1110/ps.073358908,,,eGFP203C,2OKY,,,,,,MSKGEELFTGVVPILVELDGDVNGHKFSVSGEGEGDATYGKLTLKFICTTGKLPVPWPTLVTTLTYGVQCFSRYPDHMKQHDFFKSAMPEGYVQERTIFFKDDGNYKTRAEVKFEGDTLVNRIELKGIDFKEDGNILGHKLEYNYNSHNVYIMADKQKNGIKVNFKIRHNIEDGSVQLADHYQQNTPIGDGPVLLPDNHYLCTQSALSKDPNEKRDHMVLLEFVTAAGITHGMDELYK,egfp203c,,509,498,,,,default,,,egfp203c_default,,,,,,,,,,,b,,,,,,,,C16U6
d,10.1110/ps.073358908,,,eGFP205C,2OKW,,,,,,MSKGEELFTGVVPILVELDGDVNGHKFSVSGEGEGDATYGKLTLKFICTTGKLPVPWPTLVTTLTYGVQCFSRYPDHMKQHDFFKSAMPEGYVQERTIFFKDDGNYKTRAEVKFEGDTLVNRIELKGIDFKEDGNILGHKLEYNYNSHNVYIMADKQKNGIKVNFKIRHNIEDGSVQLADHYQQNTPIGDGPVLLPDNHYLSTQCALSKDPNEKRDHMVLLEFVTAAGITHGMDELYK,egfp205c,,509,489,,,,default,,,egfp205c_default,,,,,,,,,,,b,,,,,,,,54TPA
,10.1016/s0896-6273(02)01099-1,,,Enhanced Cyan-Emitting GFP,1CV7,,,,,,MSKGEELFTGVVPILVELDGDVNGHRFSVSGEGEGDATYGKLTLKFICTTGKLPVPWPTLVTTLTWGVQCFSRYPDHMKQHDFFKSAMPEGYVQERTIFFKDDGNYKTRAEVKFEGDTLVNRIELKGIDFKEDGNILGHKLEYNYISHNVYITADKQKNGIKAHFKIRHNIEDGSVQLADHYQQNTPIGDGPVLLPDNHYLSTQSALSKDPNEKRDHMVLLEFVTAAG,enhanced-cyan-emitting-gfp,,485,458,,,,default,,,enhanced-cyan-emitting-gfp_default,,,,,,,,,,,b,,,,,,,,R3OET
t,10.1371/journal.pone.0002680,ACD13193,14926074,fabdGFP,,,,,,,MSVIKPDMKIKLRMEGAVNGHKFAIEGEGKGQPFQGKQTMNLKVKEGGPLPFAYDILTTIFNYGNRVFAKYPDDIVDYFKQSFPEGYSWERSMTYEDGGICIATNDITLDGDCFVYKIRFDGVNFPAKSPVLQKKTQKWEPSTEKLYVRDGLLKGDVNMALLLEGGGHYRCDFKTTYKAKKVVQLPDYHFVDHCIEIVSHDKDYNNVKLCEHAEAHSGLPKEAK,fabdgfp,63.07,520,508,116800,,,default,,0.54,fabdgfp_default,,,,,,,,,,,b,,,,,,,B6CTZ4,BQFPM
d,10.1038/10904,,,Folding Reporter GFP,2B3Q,,,,,,MSKGEELFTGVVPILVELDGDVNGHKFSVSGEGEGDATYGKLTLKFICTTGKLPVPWPTLVTTLTYGVQCFSRYPDHMKRHDFFKSAMPEGYVQERTISFKDDGNYKTRAEVKFEGDTLVNRIELKGIDFKEDGNILGHKLEYNYNSHNVYITADKQKNGIKANFKIRHNIEDGSVQLADHYQQNTPIGDGPVLLPDNHYLSTQSALSKDPNEKRDHMVLLEFVTAAGITHGMDELYK,folding-reporter-gfp,59.33,530,490,82400,,,default,,0.72,folding-reporter-gfp_default,,,,,,,,,,,b,,,,,,,,N6ZHS
m,10.1016/j.chembiol.2017.12.005,BBC28144,174808012,Gamillus,5Y01,5Y00,,,,,MVSKGEEASGRALFQYPMTSKIELNGEINGKKFKVAGEGFTPSSGRFNMHAYCTTGDLPMSWVVIASPLQYGFHMFAHYPEDITHFFQECFPGSYTLDRTLRMEGDGTLTTHHEYSLEDGCVTSKTTLNASGFDPKGATMTKSFVKQLPNEVKITPHGPNGIRLTSTVLYLKEDGTIQIGTQDCIVTPVGGRKVTQPKAHFLHTQIIQKKDPNDTRDHIVQTELAVAGNLWHGMDELYK,gamillus,74.7,519,504,83000,,8.0,On,3.4,0.9,gamillus_on,,,,,,,Off,,,gamillus_off,ps,gamillus_on,gamillus_off,488,gamillus_off,gamillus_on,388,,21PQ5
m,10.1016/j.chembiol.2017.12.005,,,Gamillus0.1,,,,,,,MASGRALFQYPMTSKIELNGEINGKKFKVAGEGFTPNSGRFNMHAYCTTGDLPMSWVVIASPLQYGFHMFAHYPEDITHFFQECFPGSYTLDRTLRMEGDGTLTTHHEYSLKDGCVTSKTTLNASGFDPKGATMTKSFVEQLPNQVEITAEGNGIRLTSTVPYLKKDGTIQIGRQDCIVKPVGGKKVTQPKAHFLHTQIIQKKDPNDTRDHIVQTELAVAGNPWHEPSASAV,gamillus01,16.8,524,505,20000,,,default,4.0,0.84,gamillus01_default,,,,,,,,,,,b,,,,,,,,AW33C
d,10.1016/j.chembiol.2017.12.005,,,Gamillus0.2,,,,,,,MASGRALFQYPMTSKIELNGEINGKKFKVAGEGFTPNSGRFNMHAYCTTGDLPMSWVVIASPLQYGFHMFAHYPEDITHFFQECFPGSYTLDRTLRMEGDGTLTTHHEYSLKDGCVTSKTTLNASGFDPKGATMTKSFVEQLPNQVEITAEGNGIRLTSTVLYLKKDGTIQIGRQDCIVKPVGGKKVTQPKAHFLHTQIIQKKDPNDTRDHIVQTELAVAGNPWHEPSASAV,gamillus02,51.7,524,505,55000,,,default,4.0,0.94,gamillus02_default,,,,,,,,,,,b,,,,,,,,WLNHW
m,10.1016/j.chembiol.2017.12.005,,,Gamillus0.3,,,,,,,MASGRALFQYPMTSKIELNGEINGKKFKVAGEGFTPNSGRFNMHAYCTTGDLPMSWVVIASPLQYGFHMFAHYPEDITHFFQECFPGSYTLDRTLRMEGDGTLTTHHEYSLKDGCVTSKTTLNASGFDPKGATMTKSFVEQLPNQVEITAEGNGIRLTSTVLYLKKDGTIQIGTQDCIVKPVGGKKVTQPKAHFLHTQIIQKKDPNDTRDHIVQTELAVAGNPWHEPSASAV,gamillus03,44.88,524,505,51000,,,default,4.0,0.88,gamillus03_default,,,,,,,,,,,b,,,,,,,,LQXJ6
m,10.1016/j.chembiol.2017.12.005,,,Gamillus0.4,,,,,,,MASGRALFQYPMTSKIELNGEINGKKFKVAGEGFTPSSGRFNMHAYCTTGDLPMSWVVIASPLQYGFHMFAHYPEDITHFFQECFPGSYTLDRTLRMEGDGTLTTHHEYSLEDGCVTSKTTLNASGFDPKGATMTKSFVEQLPNQVKITAEGNGIRLTSTVLYLKKDGTIQIGTQDCIVKPVGGRKVTQPKAHFLHTQIIQKKDPNDTRDHIVQTELAVAGNLWHEPSASAV,gamillus04,66.75,524,505,75000,,,default,4.0,0.89,gamillus04_default,,,,,,,,,,,b,,,,,,,,JVUSZ
m,10.1016/j.chembiol.2017.12.005,,,Gamillus0.5,,,,,,,MASGRALFQYPMTSKIELNGEINGKKFKVAGEGFTPSSGRFNMHAYCTTGDLPMSWVVIASPLQYGFHMFAHYPEDITHFFQECFPGSYTLDRTLRMEGDGTLTTHHEYSLEDGCVTSKTTLNASGFDPKGATMTKSFVKQLPNEVKITAEGNGIRLTSTVLYLKEDGTIQIGTQDCIVKPVGGRKVTQPKAHFLHTQIIQKKDPNDTRDHIVQTELAVAGNLWHEPSASAV,gamillus05,,,,,,,,,,,,,,,,,,,,,,,,,,,,,E5GAC
t,10.1371/journal.pone.0002680,ABB17962,4901546,gfasGFP,,,,,,,MNVIKPDMKIKLCMRGTINGHNFVIEGEGKGNPYEGTQILDLNVTEGAPLPFAYDILTTVFQYGNRAFTKYPADIQDYFKQTFPEGYHWERSMTYEDQGICTATSNISMRGDCFFYDIRFDGVNFPPNGPVMQKKTLKWEPSTEKMYVRDGVLKGDVNMALLLEGGGHYRCDFKTTYKAKKDVRLPDYHFVDHRIEILKHDKDYNKVELYENAVARYSMLPSQAK,gfasgfp,74.83,506,492,102500,,,default,,0.73,gfasgfp_default,,,,,,,,,,,b,,,,,,,A8CLT2,ASMG7