agg,doi,genbank,ipg_id,name,pdb.0,pdb.1,seq,slug,states.0.brightness,states.0.em_max,states.0.ex_max,states.0.ext_coeff,states.0.lifetime,states.0.maturation,states.0.name,states.0.pka,states.0.qy,states.0.slug,states.1.brightness,states.1.em_max,states.1.ex_max,states.1.ext_coeff,states.1.lifetime,states.1.maturation,states.1.name,states.1.pka,states.1.qy,states.1.slug,switch_type,transitions.0.from_state,transitions.0.to_state,transitions.0.trans_wave,transitions.1.from_state,transitions.1.to_state,transitions.1.trans_wave,uniprot,uuid
,10.1002/cbic.200300818,,,(3-F)Tyr-EGFP,1RRX,,SKGEELFTGVVPILVELDGDVNGHKFSVSGEGEGDATYGKLTLKFICTTGKLPVPWPTLVTTLGYGVQCFSRYPDHMKQHDFFKSAMPEGYVQERTIFFKDDGNYKTRAEVKFEGDTLVNRIELKGIDFKEDGNILGHKLEYNYNSHNVYIMADKQKNGIKVNFKIRHNIEDGSVQLADHYQQNTPIGDGPVLLPDNHYLSTQSALSKDPNEKRDHMVLLEFVTAAGI,3-ftyr-egfp,,514,484,,,,default,,,3-ftyr-egfp_default,,,,,,,,,,,b,,,,,,,,2VPWT
d,10.1101/677344,,,AausFP4,,,MNCGALLFQQKVPFIVEMEGDVNGEIFSVRGNGFGNATTGKLDILFVCTTGEIPVAWESLISSLAYGAFVFAKYPSNIADFFKSTMPEGYIQERKVTFENDGTYETHATVTYENGAIFERVKLTGTGFREDGNILGKKLEITSLGTPLSIMADDEGKGLRSVFNQAIKVVGGNRQIAIHEQRNRPIGDGLISVPDYHTLHNHLKCSKVSTEKRDHMMVNETLKAIDCQTAYL,aausfp4,,513,477,69000,,,On,,,aausfp4_on,,,,,,,Off,,0.001,aausfp4_off,ps,aausfp4_off,aausfp4_on,340,aausfp4_on,aausfp4_off,480,,F5F6H
m,10.1074/jbc.m109.092320,AAN41637,1780484,aceGFP,3LVA,,MSKGAELFTGIVPILIELNGDVNGHKFSVSGEGEGDATYGKLTLKFICTTGKLPVPWPTLVTTLSYGVQCFSRYPDHMKQHDFFKSAMPEGYIQERTIFFEDDGNYKSRAEVKFEGDTLVNRIELTGTDFKEDGNILGNKMEYNYNAHNVYIMTDKAKNGIKVNFKIRHNIEDGSVQLADHYQQNTPIGDGPVLLPDNHYLSTQSALSKDPNEKRDHMIYFGFVTAAAITHGMDELYK,acegfp,27.5,505,480,50000,,,default,,0.55,acegfp_default,,,,,,,,,,,b,,,,,,,Q6YGZ0,GQRF2
wd,,,,AcGFP1,,,MVSKGAELFTGIVPILIELNGDVNGHKFSVSGEGEGDATYGKLTLKFICTTGKLPVPWPTLVTTLSYGVQCFSRYPDHMKQHDFFKSAMPEGYIQERTIFFEDDGNYKSRAEVKFEGDTLVNRIELTGTDFKEDGNILGNKMEYNYNAHNVYIMTDKAKNGIKVNFKIRHNIEDGSVQLADHYQQNTPIGDGPVLLPDNHYLSTQSALSKDPNEKRDHMIYFGFVTAAAITHGMDELYK,acgfp1,27.5,505,475,50000,,,default,,0.55,acgfp1_default,,,,,,,,,,,b,,,,,,,,6ORKJ
t,10.1073/pnas.0502250102,,,amFP506,2A48,,MALSNKFIGDDMKMTYHMDGCVNGHYFTVKGEGNGKPYEGTQTSTFKVTMANGGPLAFSFDILSTVFKYGNRCFTAYPTSMPDYFKQAFPDGMSYERTFTYEDGGVATASWEISLKGNCFEHKSTFHGVNFPADGPVMAKKTTGWDPSFQKMTVCDGILKGDVTAFLMLQGGGNYRCQFHTSYKTKKPVTMPPNHVVEHRIARTDLDKGGNSVQLTEHAVAHITSVVPF,amfp506,,506,483,,,,default,,0.67,amfp506_default,,,,,,,,,,,b,,,,,,,,VQMW2
,10.1002/cbic.200300818,,,avGFP514,,,,avgfp514,,514,484,,,,default,,,avgfp514_default,,,,,,,,,,,b,,,,,,,,G413J
,10.1101/677344,,,AvicFP2,,,MNCGALLFKQKIPFIVELDGDVNGQVFSVRGNGFGDGSIGKIEIKFVCTTGEIPVAWESLVCSLAYGALVFTKYPSNINDFFKSTMPKGYIQERKITFENDGQYETRAEVTYENGALYNRVKLNGSGFRKDGNILGKKLDATSLGTCIYILSNDEGNGLKGVYNMAYKVIDGNRQIVSHQQTNTPIGDGLVSIPDYHVMHNHISCSKDPTEPRDHLILKESVTAVDCQTAYM,avicfp2,2.36,515,480,59000,,,pre-conversion,,0.04,avicfp2_pre-conversion,,,,41000,,,post-conversion,,0.0,avicfp2_post-conversion,b,avicfp2_pre-conversion,avicfp2_post-conversion,480,,,,,FHG23
,10.1101/677344,,,AvicFP3,,,MNCGALLFKQKIPFIVELDGDVNGQVFSVRGNGFGDGSTGKIEIKFVCTTGEIPVAWESLVCSLAYGALVFTKYPSNINDFFKSTMPKGYIQERKITFENDGQYETRAEVTYENGALYNRVKLNGSGFRKDGNILGKKLDATSLGTCIYIMSNDQGNGLKGVYNKAYKVIGGNRQLASHQQTHTPIGDGLVSIPDYHVMHNHTSCSKDPTEPRDHLILKESVTAVDCQTAYM,avicfp3,,520,480,,,,pre-conversion,,0.001,avicfp3_pre-conversion,,,,,,,post-conversion,,,avicfp3_post-conversion,b,,,,,,,,ZJWZK
,10.1093/nar/28.16.e78,,,CGFP,,,MSKGEELFTGVVPILVELDGDVNGHKFSVSGEGEGDATYGKLTLKFICTTGKLPVPWPTLVTTLTWGVQCFSRYPDHMKQHDFFKSAMPEGYVQERTIFFKDDGNYKTRAEVKFEGDTLVNRIELKGIDFKEDGNILGHKLEYNYNSHNVYIMADKQKNGIKVNFKIRHNIEDGSVQLADHYQQNTPIGDGPVLLPDNHYLSTQSALSKDPNEKRDHMVLLEFVTAAGITHGMDELYK,cgfp,3.35,506,463,23900,,,default,4.0,0.14,cgfp_default,,,,,,,,,,,b,,,,,,,,5WSHL
,10.1523/jneurosci.4616-11.2013,,,Clomeleon,3SV5,,MVSKGEELFTGVVPILVELDGDVNGHKFSVSGEGEGDATYGKLTLKFICTTGKLPVPWPTLVTTFGYGVTCFARYPDHMRQHDFFKSAMPEGYVQERTIFFKDDGNYKTRAEVKFEGDTLVNRIELKGIDFKEDGNILGHKLEYNYNSHNVYIMADKQKNGIKANFKIRHNIEDGSVQLADHYQQNTPIGDGPVLLPDNHYLSYQSALSKDPNEKRDHMVLLEFVTAAGITLGMDELYK,clomeleon,,535,485,,,,default,,,clomeleon_default,,,,,,,,,,,b,,,,,,,,GVAVH
,10.1093/nar/28.16.e78,BAB11884,,ECGFP,,,MVSKGEELFTGVVPILVELDGDVNGHKFSVSGEGEGDATYGKLTLKFICTTGKLPVPWPTLVTTLTWGVQCFSRYPDHMKQHDFFKSAMPEGYVQERTIFFKDDGNYKTRAEVKFEGDTLVNRIELKGIDFKEDGNILGHKLEYNYISHNVYITADKQKNGIKANFKIRHNIEDGSVQLADHYQQNTPIGDGPVLLPDNHYLSYQSALSKDPNEKRDHMVLLEFVTAAGITLGMDELYK,ecgfp,3.35,506,463,23900,,,default,4.0,0.14,ecgfp_default,,,,,,,,,,,b,,,,,,,,9HU84
wd,10.1016/0378-1119(95)00685-0,,,GFPmut2,,,MSKGEELFTGVVPILVELDGDVNGHKFSVSGEGEGDATYGKLTLKFICTTGKLPVPWPTLVTTFAYGLQCFARYPDHMKQHDFFKSAMPEGYVQERTIFFKDDGNYKTRAEVKFEGDTLVNRIELKGIDFKEDGNILGHKLEYNYNSHNVYIMADKQKNGIKVNFKIRHNIEDGSVQLADHYQQNTPIGDGPVLLPDNHYLSTQSALSKDPNEKRDHMVLLEFVTAAGITHGMDELYK,gfpmut2,39.35,508,485,53900,,5.6,default,,0.73,gfpmut2_default,,,,,,,,,,,b,,,,,,,,QS3XQ
m,10.1371/journal.pone.0095808,,,iq-mEmerald,,,MVSKGEELFTGVVPILVELDGDVNGHKFSVSGEGEGDATYGKLTLKFICTTGKLPVPWPTLVTTLTYGVQCFARYPDHMKQHDFFKSAMPEGYVQERTIFFKDDGNYKTRAEVKFEGDTLVNRIELKGIDFKEDGNILGHKLEYNYNHHKVYITADKQKNGIKVNFKTRHNIEDGSVQLADHYQQNTPIGDGPVLLPDNHYLHTHSKLSKDPNEKRDHMVLLEFVTAAGITLGMDELYK,iq-memerald,33.77,509,482,50400,,,default,,0.67,iq-memerald_default,,,,,,,,,,,b,,,,,,,,7G47U
t,10.1088/2050-6120/3/1/014004,,,IrisFP-M159A,4R6B,,MSAIKPDMKINLRMEGNVNGHHFVIDGDGTGKPFEGKQSMDLEVKEGGPLPFAFDILTTAFHYGNRVFAEYPDHIQDYFKQSFPKGYSWERSLTFEDGGICIARNDITMEGDTFYNKVRFHGVNFPANGPVMQKKTLKWEPSTEKMYVRDGVLTGDITAALLLEGNAHYRCDSRTTYKAKEKGVKLPGYHLVDHCIEILSHDKDYNKVKLYEHAVAHSGLPDNARR,irisfp-m159a,11.3,513,484,62800,,,Green,4.7,0.18,irisfp-m159a_green,,,,,,,Green (off),,,irisfp-m159a_green-off,ps,irisfp-m159a_green,irisfp-m159a_green-off,488,irisfp-m159a_green-off,irisfp-m159a_green,405,,T44HU
,10.1074/jbc.m312846200,,,roGFP1,1JC0,,MSKGEELFTGVVPILVELDGDVNGHKFSVSGEGEGDATYGKLTLKFISTTGKLPVPWPTLVTTLGYGVQCFSRYPDHMKRHDFFKSAMPEGYVQERTIFFKDDGNYKTRAEVKFEGDTLVNRIELKGIDFKEDGNILGHKLEYNYNCHNVYIMADKQKNGIKVNFKIRHNIEDGSVQLADHYQQNTPIGDGPVLLPDNHYLSTCSALSKDPNEKRDHMVLLEFVTAAGITHGMDELYK,rogfp1,,508,475,,,,default,,,rogfp1_default,,,,,,,,,,,b,,,,,,,,ZE3SV
d,10.1007/s10126-007-9072-7,AAK54757,267657,rrenGFP,,,MDLAKLGLKEVMPTKINLEGLVGDHAFSMEGVGEGNILEGTQEVKISVTKGAPLPFAFDIVSVAFSYGNRAYTGYPEEISDYFLQSFPEGFTYERNIRYQDGGTAIVKSDISLEDGKFIVNVDFKAKDLRRMGPVMQQDIVGMQPSYESMYTNVTSVIGECIIAFKLQTGKHFTYHMRTVYKSKKPVETMPLYHFIQHRLVKTNVDTASGYVVQHETAIAAHSTIKKIEGSLP,rrengfp,,508,485,,,,default,,,rrengfp_default,,,,,,,,,,,b,,,,,,,Q963I9,6HML4
,10.1038/nsb0597-361,,,sg25,1EMK,,MASKGEELFTGVVPILVELDGDVNGHKFSVSGEGEGDATYGKLTLKFICTTGKLPVPWPTLVTTLCYGVQCFSRYPDHMKRHDFFKSAMPEGYVQERTIFFKDDGNYKTRAEVKFEGDTLVNRIELKGIDFKEDGNILGHKLEYNYNSHNVYIMADKQKNGIKVNFKTRHNIEDGSVQLADHYQQNTPIGDGPVLLPDNHYLSTQSALSKDPNEKRDHMVLLEFVTAAGITHGMDELYN,sg25,19.91,506,474,26200,,,default,,0.76,sg25_default,,,,,,,,,,,b,,,,,,,,7ZG25
wd,10.1038/nbt1172,ASL68970,154375264,Superfolder GFP,2B3P,2Q6P,MSKGEELFTGVVPILVELDGDVNGHKFSVRGEGEGDATNGKLTLKFICTTGKLPVPWPTLVTTLTYGVQCFSRYPDHMKRHDFFKSAMPEGYVQERTISFKDDGTYKTRAEVKFEGDTLVNRIELKGIDFKEDGNILGHKLEYNFNSHNVYITADKQKNGIKANFKIRHNVEDGSVQLADHYQQNTPIGDGPVLLPDNHYLSTQSVLSKDPNEKRDHMVLLEFVTAAGITHGMDELYK,superfolder-gfp,54.15,510,488,83300,3.1,13.6,default,,0.65,superfolder-gfp_default,,,,,,,,,,,b,,,,,,,,B4SOW
d,10.1016/j.chembiol.2008.08.006,,,TagGFP,,,MSGGEELFAGVVPILVELDGDVNGHKFSVSGEGEGDATYGKLTLKFICTTGKLPVPWPTLVTTLCYGVQCFSRYPDHMKQHDFFKSAMPEGYVQERTILFKDDGNYKTRAEVKFEGDTLVNRIELKGKDFKEDGNILGHKLEYSYNSHNVYIMADKQKNGIEVNFKTRHNIEDGSVQLADHYQQNTPIGDGPVLLPDNHYLSTQSALSKDPNEARDHMVLLELSTAACITHGMDELYR,taggfp,33.0,505,482,55000,,18.0,default,5.0,0.6,taggfp_default,,,,,,,,,,,b,,,,,,,,2V75Y
m,10.1016/j.chembiol.2008.08.006,,,TagGFP2,,,MSGGEELFAGIVPVLIELDGDVHGHKFSVRGEGEGDADYGKLEIKFICTTGKLPVPWPTLVTTLCYGIQCFARYPEHMKMNDFFKSAMPEGYIQERTIQFQDDGKYKTRGEVKFEGDTLVNRIELKGKDFKEDGNILGHKLEYSFNSHNVYIRPDKANNGLEANFKTRHNIEGGGVQLADHYQTNVPLGDGPVLIPINHYLSTQTKISKDRNEARDHMVLLESFSACCHTHGMDELYR,taggfp2,33.9,506,483,56500,3.2,11.0,default,4.7,0.6,taggfp2_default,,,,,,,,,,,b,,,,,,,,GJETS
d,10.1002/anie.201506686,,,vsfGFP-0,4PFE,,MSKGEELFTGVVPILVELDGDVNGHKFSVRGEGEGDATNGKLTLKFICTTGKLPVPWPTLVTTLTYGVQCFSRYPDHMKRHDFFKSAMPEGYVQERTISFKDDGTYKTRAEVKFEGDTLVNRIELKGIDFKEDGNILGHKLEYNFNSHNVYITADKQKNGIKANFKIRHNVEDGSVQLADHYQQNTPIGDGPVLLPDNHYLSTQSVLSKDPNEKRDHMVLLEFVTAAGIAQVQLVESGGALVQPGGSLRLSCAASGFPVNRYSMRWYRQAPGKEREWVAGMSSAGDRSSYEDSVKGRFTISRDDARNTVYLQMNSLKPEDTAVYYCNVNVGFEYWGQGTQVTVS,vsfgfp-0,159.54,510,485,209916,,,default,4.84,0.76,vsfgfp-0_default,,,,,,,,,,,b,,,,,,,,BH9MB
m,10.1002/anie.201506686,,,vsfGFP-9,,,MSKGEELFTGVVPILVELDGDVNGHKFSVRGEGEGDATNGKLTLKFICTTGKLPVPWPTLVTTLTYGVQCFSRYPDHMKRHDFFKSAMPEGYVQERTISFKDDGTYKTRAEVKFEGDTLVNRIELKGIDFKEDGNILGHKLEYNFNSHNVYITADKQKNGIKANFKIRHNVEDGSVQLADHYQQNTPIGDGPVLLPDNHYLSTQSVLSKDPNEKRDHMVLLEFVTAAGITHGMDELYKAQVQLVESGGALVQPGGSLRLSCAASGFPVNRYSMRWYRQAPGKEREWVAGMSSAGDRSSYEDSVKGRFTISRDDARNTVYLQMNSLKPEDTAVYYCNVNVGFEYWGQGTQVTVS,vsfgfp-9,73.47,510,485,104958,,,default,4.75,0.7,vsfgfp-9_default,,,,,,,,,,,b,,,,,,,,ACXOE
