agg,doi,genbank,ipg_id,name,pdb.0,pdb.1,pdb.2,pdb.3,pdb.4,seq,slug,states.0.brightness,states.0.em_max,states.0.ex_max,states.0.ext_coeff,states.0.lifetime,states.0.maturation,states.0.name,states.0.pka,states.0.qy,states.0.slug,states.1.brightness,states.1.em_max,states.1.ex_max,states.1.ext_coeff,states.1.lifetime,states.1.maturation,states.1.name,states.1.pka,states.1.qy,states.1.slug,switch_type,transitions.0.from_state,transitions.0.to_state,transitions.0.trans_wave,transitions.1.from_state,transitions.1.to_state,transitions.1.trans_wave,uniprot,uuid
d,10.1101/677344,,,AausFP1,,,,,,MSYGALLFREKIPYVVEMEGDVEGMKFSVRGKGHGDANTGKIEASFICTTGELPVPWSSILTTVTYGAQCFAKYPNDIKDYPKSAMPEGYVQERTITFENDGVYKTRAEVTYEKGSVYNRVTLNGSGFKKGGNILGKKLEFNYNPHCIYVLPDVQNNGIKCYINIVHDVIGGGQIIAAHQQLNTPLGGGPVDIPHYHHIQAHTILSKDPKETRDHMNVVEVFRAIDCKTAYA,aausfp1,164.9,510,504,170000,,,default,4.4,0.97,aausfp1_default,,,,,,,,,,,b,,,,,,,,C2FJQ
,10.1515/bc.2004.038,,,avGFP510,1RMM,,,,,,avgfp510,,510,488,,,,default,,,avgfp510_default,,,,,,,,,,,b,,,,,,,,PEHFX
wd,10.1074/jbc.273.14.8212,,,EBFP,,,,,,MVSKGEELFTGVVPILVELDGDVNGHKFSVSGEGEGDATYGKLTLKFICTTGKLPVPWPTLVTTLTHGVQCFSRYPDHMKQHDFFKSAMPEGYVQERTIFFKDDGNYKTRAEVKFEGDTLVNRIELKGIDFKEDGNILGHKLEYNFNSHNVYIMADKQKNGIKVNFKIRHNIEDGSVQLADHYQQNTPIGDGPVLLPDNHYLSTQSALSKDPNEKRDHMVLLEFVTAAGITLGMDELYK,ebfp,6.3,440,380,31500,,,default,,0.2,ebfp_default,,,,,,,,,,,b,,,,,,,,1LZV9
t,10.1371/journal.pone.0002680,ABB17956,4901576,eechGFP1,,,,,,MSVINPDMKIKLYMEGAVNGHKFEIKGEGNGKPFEGKQTMDLAVVDGGPLPFAFDILTTSFNYGNRVFTKYPDTIVDYFKPSFPEGYSWERSMTYEDGGICIATNDITLLKDTDDSNYFYYKIRFDGVNFAANGPVMQKKTAKWEPSTEKMYVRDGVLKGEVNMALLLEGGGHYRCDFKTTYKAKKVVRLPSYHFVDHRIEILSHSKDYNQVRLHEHAEAHSGLPRQAK,eechgfp1,93.15,510,497,124200,,,default,,0.75,eechgfp1_default,,,,,,,,,,,b,,,,,,,A8CLQ1,MX4SD
d,10.1038/nmeth.1501,ADR83529,,eqFP650,4EDO,,,,,MGEDSELISENMHMKLYMEGTVNGHHFKCTSEGEGKPYEGTQTAKIKVVEGGPLPFAFDILATSFMYGSKTFINHTQGIPDFFKQSFPEGFTWERITTYEDGGVLTATQDTSLQNGCLIYNVKINGVNFPSNGPVMQKKTLGWEASTEMLYPADSGLRGHSQMALKLVGGGYLHCSLKTTYRSKKPAKNLKMPGFYFVDRKLERIKEADKETYVEQHEMAVARYCDLPSKLGHS,eqfp650,15.6,650,592,65000,,,default,5.7,0.24,eqfp650_default,,,,,,,,,,,b,,,,,,,,JS838
,10.1002/anie.201204962,,,GFP-151pyTyrCu,4GF6,,,,,MSKGAELFTGVVPILVELDGDVNGHKFSVSGEGEGDATYGKLTLKFICTTGKLPVPWPTLVTTFSYGVQCFSRYPDHMKAHDFFKSAMPEGYVQERTISFKDDGNYKTRAEVKFEGDTLVNRIALKGIDFKEAGNILGHKLEYNYNSHNVYITADKQKNGIKANFKIRHNIADGSVQLADHYQQNTPIGAGPVLLPDNHYLSTQSALSKDPNEKRDHMVLLEFVTAAGITHGMDEAYK,gfp-151pytyrcu,,510,375,,,,default,,,gfp-151pytyrcu_default,,,,,,,,,,,b,,,,,,,,L1JAY
d,10.1038/373663b0,,,GFP (S65T),1EMG,1C4F,1Q4B,1Q4A,1EMA,MSKGEELFTGVVPILVELDGDVNGHKFSVSGEGEGDATYGKLTLKFICTTGKLPVPWPTLVTTFTYGVQCFSRYPDHMKQHDFFKSAMPEGYVQERTIFFKDDGNYKTRAEVKFEGDTLVNRIELKGIDFKEDGNILGHKLEYNYNSHNVYIMADKQKNGIKVNFKIRHNIEDGSVQLADHYQQNTPIGDGPVLLPDNHYLSTQSALSKDPNEKRDHMVLLEFVTAAGITHGMDELYK,gfp-s65t,35.2,510,490,55000,,,default,,0.64,gfp-s65t_default,,,,,,,,,,,b,,,,,,,,B6J33
m,10.1007/s10126-006-6006-8,AAL33912,665233,GFPxm161,,,,,,MSKGEELFTGIVPVLIELDGDVHGHKFSVRGEGEGDADYGKLEIKFICTTGKLPVPWPTLVTTLGYGIQCFARYPEHMKMNDFFKSAMPEGYIQERTIFFQDDGKYKTRGEVKFEGDTLVNRIELKGMDFKEDGNILGHKLEYNFNSHNVYIMPDKANNGLKVNFKIRHNIEGGGVQLADHYQTNVPLGDGPVLIPINHYLSLQTAISKDRNETRDHMVFLEFFSACGHTHGMDELYK,gfpxm161,,510,500,,,,default,,,gfpxm161_default,,,,,,,,,,,b,,,,,,,Q8WTD0,PK2PN
m,10.1007/s10126-006-6006-8,AAL33915,1388169,GFPxm191uv,,,,,,MSKGEELFTGIVPVLIELDGDVHGHKFSVRGEGEGDADYGKLEIKFICTTGKLPVPWPTLVTTLSYGILCFARYPEHMKMNDFFKSAMPEGYIQERTIFFQDDGKYKTRGEVKFEGDTLVNRIELKGMDFKEDGNILGHKLEYNFNSHNVYIMPDKANNGLKVNFKIRHNIEGGGVQLADHYQTNVPLGDGPVLIPINHYLSCQTAISKDRNETRDHMVFLEFFSACGHTHGMDELYK,gfpxm191uv,,510,498,,,,default,,,gfpxm191uv_default,,,,,,,,,,,b,,,,,,,Q8WTC7,7NN4S
,10.1016/s0006-291x(03)00019-6,AAO16871,94639,hmGFP,,,,,,MYSYIKETMRSKVYMEGNVNNHAFKCTAEGEGKPYKGSQKLTITVTEGGPLPFAFDILSHAFQYGNKVFTKYPDDIPDFFKQSLSGGFTWKRVSNYEDGGVLTVDQKTSLEGDCIICNIKVHGTNFPADGPVMQKQTNGWEPSTETVIPRGEGILLRDVPALKLRNNKGHLLCVMETTYKPNKRVNLPKLHFHHLRMEKDSISDDEKTIKQHEDVRASYFNVRFDESS,hmgfp,,510,490,,,,default,,,hmgfp_default,,,,,,,,,,,b,,,,,,,Q86LV4,EKYG9
,10.1186/1745-6150-3-28,,,LanFP1,,,,,,MPLPATHDIHLHGSINGHEFDMVGGGKGDPNAGSLVTTAKSTKGALKFSPYLMIPHLGYGYYQYLPYPDGPSPFQASMLEGSGYAVYRVFDFEDGGKLTTEFKYSYEGSHIKADMKLMGSGFPDDGPVMTSQIVDQDGCVSKKTYLNNNTIVDSFDWSYNLQNGKRYRARVSSHYIFDKPFSADLMKKQPVFVYRKCHVKASKTEVTLDEREKAFYELAG,lanfp1,30.21,510,500,53000,,,default,,0.57,lanfp1_default,,,,,,,,,,,b,,,,,,,,T9CO9
d,10.1038/nmeth.4045,,,Maroon0.1,,,,,,MVSKGEELIKENMHMKLYMEGTVNNHHFKCTSEGEGKPYEGTQTGRIKVVEGGPLPFAFDILAPCFMYGSKTFINHTQGIPDFFKQSFPEGFTWERVTTYEDGGVLTVTQDTSLQDGCLIYNVKLRGVNFPSNGPVMQKKTLGWEASTETLYPADGGLEGRCDWALKLVGGGHLHCNLKTTYRSKKPAKNLKMPGVYFVDRRLERIKEADNETYVEQHEVAVARYCDLPSKLGHKLNGMDELYK,maroon01,5.5,650,610,50000,,,default,,0.11,maroon01_default,,,,,,,,,,,b,,,,,,,,6F9A8
,10.4319/lo.2003.48.1_part_2.0402,AAK62982,190667,mcavFP,,,,,,MSVIKPIMEIKLRMQGVVNGHKFVIKGEGEGKPFEGTQTINLTVKEGAPLPFAYDILTSAFQYGNRVFTKYPDDIPDYFKQTFPEGYSWERIMAYEDQSICTATSDIKMEGDCFIYEIQFHGVNFPPNGPVMQKKTLKWEPSTEKMYVRDGVLKGDVNMALLLEGGGHYRCDFRSTYKAKKRVQLPDYHFVDHRIEILSHDNDYNTVKLSEDAEARYSMLPSQAK,mcavfp,,510,440,,,,default,,,mcavfp_default,,,,,,,,,,,b,,,,,,,Q963F5,SF8MO
m,10.1016/j.chembiol.2009.10.009,ACZ95826,19025958,mNeptune,,,,,,MVSKGEELIKENMHMKLYMEGTVNNHHFKCTSEGEGKPYEGTQTGRIKVVEGGPLPFAFDILATCFMYGSKTFINHTQGIPDFFKQSFPEGFTWERVTTYEDGGVLTATQDTSLQDGCLIYNVKIRGVNFPSNGPVMQKKTLGWEASTETLYPADGGLEGRCDMALKLVGGGHLICNLKTTYRSKKPAKNLKMPGVYFVDRRLERIKEADKETYVEQHEVAVARYCDLPSKLGHKLNGMDELYK,mneptune,13.4,650,600,67000,,35.0,default,5.4,0.2,mneptune_default,,,,,,,,,,,b,,,,,,,,1LT8G
m,10.1038/ncomms8670,,,moxGFP,,,,,,MVSKGEELFTGVVPILVELDGDVNGHKFSVRGEGEGDATNGKLTLKFISTTGKLPVPWPTLVTTLTYGVQSFSRYPDHMKRHDFFKSAMPEGYVQERTISFKDDGTYKTRAEVKFEGDTLVNRIELKGIDFKEDGNILGHKLEYNFNSHNVYITADKQKNGIKANFKIRHNVEDGSVQLADHYQQNTPIGDGPVLLPDNHYLSTQSKLSKDPNEKRDHMVLLEFVTAAGITHGMDELYK,moxgfp,50.46,510,486,87000,,17.1,default,,0.58,moxgfp_default,,,,,,,,,,,b,,,,,,,,H99SX
d,10.1016/j.chembiol.2009.10.009,ACZ95825,19025957,Neptune,3IP2,,,,,MVSKGEELIKENMHMKLYMEGTVNNHHFKCTSEGEGKPYEGTQTGRIKVVEGGPLPFAFDILATCFMYGSKTFINHTQGIPDFFKQSFPEGFTWERVTTYEDGGVLTATQDTSLQDGCLIYNVKIRGVNFPSNGPVMQKKTLGWEASTEMLYPADGGLEGRCDMALKLVGGGHLICNLKTTYRSKKPAKNLKMPGVYFVDRRLERIKEADKETYVEQHEVAVARYCDLPSKLGHKLNGMDELYK,neptune,12.96,650,600,72000,,35.0,default,5.8,0.18,neptune_default,,,,,,,,,,,b,,,,,,,,Z3GLX
d,10.1038/ncomms8670,,,oxGFP,,,,,,MVSKGEELFTGVVPILVELDGDVNGHKFSVRGEGEGDATNGKLTLKFISTTGKLPVPWPTLVTTLTYGVQSFSRYPDHMKRHDFFKSAMPEGYVQERTISFKDDGTYKTRAEVKFEGDTLVNRIELKGIDFKEDGNILGHKLEYNFNSHNVYITADKQKNGIKANFKIRHNVEDGSVQLADHYQQNTPIGDGPVLLPDNHYLSTQSVLSKDPNEKRDHMVLLEFVTAAGITHGMDELYK,oxgfp,50.46,510,486,87000,,,default,,0.58,oxgfp_default,,,,,,,,,,,b,,,,,,,,JJV3D
m,10.1038/nature10497,AFM74241,,rsEGFP,,,,,,MVSKGEELFTGVVPILVELDGDVNGHKFSVSGEGEGDATYGKLTLKFICTTGKLPVPWPTLVTTLTYGVLCFSRYPDHMKQHDFFKSAMPEGYVQERTIFFKDDGNYKTRAEVKFEGDTLVNRIELKGIDFKEDGNILGHKLEYNYNSHNAYIMADKQKNGIKSNFKIRHNIEDGSVQLADHYQQNTPIGDGPVLLPDNHYLSTQNKLSKDPNEKRDHMVLLEFVTAAGITLGMDELYK,rsegfp,,,,,,,Off,,,rsegfp_off,16.92,510,493,47000,,180.0,On,6.5,0.36,rsegfp_on,ps,rsegfp_on,rsegfp_off,491,rsegfp_off,rsegfp_on,405,,JYYJ1
wd,10.1038/nbt1172,ASL68970,154375264,Superfolder GFP,2B3P,2Q6P,,,,MSKGEELFTGVVPILVELDGDVNGHKFSVRGEGEGDATNGKLTLKFICTTGKLPVPWPTLVTTLTYGVQCFSRYPDHMKRHDFFKSAMPEGYVQERTISFKDDGTYKTRAEVKFEGDTLVNRIELKGIDFKEDGNILGHKLEYNFNSHNVYITADKQKNGIKANFKIRHNVEDGSVQLADHYQQNTPIGDGPVLLPDNHYLSTQSVLSKDPNEKRDHMVLLEFVTAAGITHGMDELYK,superfolder-gfp,54.15,510,488,83300,3.1,13.6,default,,0.65,superfolder-gfp_default,,,,,,,,,,,b,,,,,,,,B4SOW
m,10.1186/s12915-018-0514-7,MH135776,,SuperNova Green,,,,,,MEVGPALFQSDMTFKIFIDGEVNGQKFTIVADGSSKFPHGDFNAHAVCETGKLPMSWKPICHLIQWGEPFFARYPDGISHFAQECFPEGLSIDRTVRFENDGTMTSHHTYELDDTCVVSRITVNCDGFQPDGPIMRDQLVDILPSETHMFPHGPNAVRQTATIGFTTADGGKMMGHFDSKMTFNGSRAIEIPGPHFVTIITKQTRDTSDKRDHVCQREVAYAHSVPRITSAIGSDED,supernova-green,6.44,510,440,28000,,,default,,0.23,supernova-green_default,,,,,,,,,,,b,,,,,,,,3CN24
