agg,doi,genbank,ipg_id,name,pdb.0,pdb.1,pdb.10,pdb.2,pdb.3,pdb.4,pdb.5,pdb.6,pdb.7,pdb.8,pdb.9,seq,slug,states.0.brightness,states.0.em_max,states.0.ex_max,states.0.ext_coeff,states.0.lifetime,states.0.maturation,states.0.name,states.0.pka,states.0.qy,states.0.slug,states.1.brightness,states.1.em_max,states.1.ex_max,states.1.ext_coeff,states.1.lifetime,states.1.maturation,states.1.name,states.1.pka,states.1.qy,states.1.slug,states.2.brightness,states.2.em_max,states.2.ex_max,states.2.ext_coeff,states.2.lifetime,states.2.maturation,states.2.name,states.2.pka,states.2.qy,states.2.slug,states.3.brightness,states.3.em_max,states.3.ex_max,states.3.ext_coeff,states.3.lifetime,states.3.maturation,states.3.name,states.3.pka,states.3.qy,states.3.slug,switch_type,transitions.0.from_state,transitions.0.to_state,transitions.0.trans_wave,transitions.1.from_state,transitions.1.to_state,transitions.1.trans_wave,transitions.2.from_state,transitions.2.to_state,transitions.2.trans_wave,transitions.3.from_state,transitions.3.to_state,transitions.3.trans_wave,transitions.4.from_state,transitions.4.to_state,transitions.4.trans_wave,uniprot,uuid
,10.1126/science.273.5280.1392,,,11,,,,,,,,,,,,MSKGEELFTGVVPILVELDGDVNGHKFSVSGEGEGDATYGKLTLKFICTTGKLPVPWPTLVTTFGYGVQCFARYPDHMKQHDFFKSAMPEGYVQERTIFFKDDGNYKTRAEVKFEGDTLVNRIELKGIDFKEDGNILGHKLEYNYNSHNVYIMADKQKNGIKVNFKIRHNIEDGSVQLADHYQQNTPIGDGPVLLPDNHYLSWQSALSKDPNEKRDHMVLLEFVTAAGITHGMDELYK,11,,512,502,33000,,,default,,,11_default,,,,,,,,,,,,,,,,,,,,,,,,,,,,,,,b,,,,,,,,,,,,,,,,,W92N1
t,10.1371/journal.pone.0002680,AAU06845,3620755,aacuGFP2,,,,,,,,,,,,MSYSKQGIVQEMKTKYRMEGSVNGHEFTIEGVGTGYPYEGKQMSELVIIKPKGKPLPFSFDILSSVFQYGNRCFTKYPADMPDYFKQAFPDGMSYERSFLFEDGAVATASWNIRLEGNCFIHNSIFHGVNFPADGPVMKKKTIGWDKSFEKMTVSKEVLRGDVTMFLMLEGGGYHRCQFHSTYKTEKPVELPPNHVVEHQIVRTDLGQSAKGFTVKLEAHAAAHVNPLKVQ,aacugfp2,66.67,513,502,93900,,,default,,0.71,aacugfp2_default,,,,,,,,,,,,,,,,,,,,,,,,,,,,,,,b,,,,,,,,,,,,,,,,Q66PV9,3W5ZV
d,10.1101/677344,,,AausFP1,,,,,,,,,,,,MSYGALLFREKIPYVVEMEGDVEGMKFSVRGKGHGDANTGKIEASFICTTGELPVPWSSILTTVTYGAQCFAKYPNDIKDYPKSAMPEGYVQERTITFENDGVYKTRAEVTYEKGSVYNRVTLNGSGFKKGGNILGKKLEFNYNPHCIYVLPDVQNNGIKCYINIVHDVIGGGQIIAAHQQLNTPLGGGPVDIPHYHHIQAHTILSKDPKETRDHMNVVEVFRAIDCKTAYA,aausfp1,164.9,510,504,170000,,,default,4.4,0.97,aausfp1_default,,,,,,,,,,,,,,,,,,,,,,,,,,,,,,,b,,,,,,,,,,,,,,,,,C2FJQ
,10.1101/677344,,,AausFP2,,,,,,,,,,,,MACGALLFKGKIPFVVELEGDVNGEVFSVRGNGWGDGSTGKLEIKFVCTTGEVPLAWESLICSMAYGALVFCKYPSNINDFFKSTMPRGYIQERKISYENDGTFDVRQEVTYENGALYNRVKFNGSGFRKDGNVLGKKLDLTSIGTCIYIMGNDEGTGLKGVFNKAFKVIGGNRQIASHVQTQTPIGDGLVSIPDYHVMHNHIACSKDPSETRDHIIVKESLRAVDCNTEYM,aausfp2,,,609,52000,,,default,6.0,,aausfp2_default,,,,,,,,,,,,,,,,,,,,,,,,,,,,,,,b,,,,,,,,,,,,,,,,,UHNQV
,10.1101/677344,,,AausFP3,,,,,,,,,,,,MACGALLFKGKIPFVVELEGDVNGEVFSVRGNGWGDGSTGKIEIKFVCTTGEIPVAWESLVCSLAYGALVFAKYPSNINDFFKSTMPKGYIQERNIQFENDGQYVTRAEVTYENGTLYNRVKLNGSGFRKDGNILGKKLDSTSLGTCIYIMGNDQGNGLKGVYNKAYKVIGGNRQLASHQQTHTPIGDGLVSIPDYHVMHNHIACSKDPSETRDHIIVKESLRAVDCNTEYM,aausfp3,,,587,59000,,,default,6.5,,aausfp3_default,,,,,,,,,,,,,,,,,,,,,,,,,,,,,,,b,,,,,,,,,,,,,,,,,OEVJT
t,10.1002/pro.3540,,,AdRed,6AA7,,,,,,,,,,,MALSKHGLTKDMTMKYRMEGCVDGHKFVITGHGNGSPFEGKQTINLCVVEGGPLPFSEDILSAVFDYGNRVFTDYPQGMVDFFKNSCPAGYTWQRSLLFEDGAVCTASADITVSVEENCFYHESKFHGVNFPADGPVMKKMTINWEPCCEKIIPVPRQGILKGDVAMYLLLKDGGRYRCQFDTVYKAKTDSKKMPEWHFIQHKLTREDRSDAKNQKWQLAEHSVASRSALP,adred,,612,567,,,,default,4.0,,adred_default,,,,,,,,,,,,,,,,,,,,,,,,,,,,,,,b,,,,,,,,,,,,,,,,A0A1S7IWI8,DAH3B
,10.1002/pro.3540,,,AdRed-C148S,,,,,,,,,,,,MALSKHGLTKDMTMKYRMEGCVDGHKFVITGHGNGSPFEGKQTINLCVVEGGPLPFSEDILSAVFDYGNRVFTDYPQGMVDFFKNSCPAGYTWQRSLLFEDGAVCTASADITVSVEENCFYHESKFHGVNFPADGPVMKKMTINWEPSCEKIIPVPRQGILKGDVAMYLLLKDGGRYRCQFDTVYKAKTDSKKMPEWHFIQHKLTREDRSDAKNQKWQLAEHSVASRSALP,adred-c148s,,599,560,,,,default,,,adred-c148s_default,,,,,,,,,,,,,,,,,,,,,,,,,,,,,,,b,,,,,,,,,,,,,,,,,THMOX
t,10.1371/journal.pone.0002680,ACD13192,14926073,aeurGFP,,,,,,,,,,,,MSYSKQGIVQEMKTKYHMEGSVNGHEFTIEGVATGYPYEGKQMSELVIIKPKGKPLPFSFDILSSVFQYGNRCFTKYPADIPDYFKQAFPDGMSYERSFLFEDGAVATASWNIRLEGNCFIHNSIFHGVNFPADGPVMKKQTIGWDKSFEKMTVSKEVLRGDVTMFLMLEGGGYHRCQFHSTYKTEKPVTLPPNHVVEHQIVRTDLGQSAKGFTVKLEALAAAHVNPLKVQ,aeurgfp,97.62,515,504,145700,,,default,,0.67,aeurgfp_default,,,,,,,,,,,,,,,,,,,,,,,,,,,,,,,b,,,,,,,,,,,,,,,,B6CTZ3,4NRYW
t,10.1021/bp034308g,AAS18270,2033734,alajGFP1,,,,,,,,,,,,MSLSKQVIGKEMNMTYLMDGSVNGHNFTVEGEGDGKPYEGHQCLKLRITKGEPLPFAFDILTAAFCYGNRCFVNYPAEIADYFKQAFPEGLTWERSMTFEDGGFAAVSADISLNGNCFVHQSKFVGVNFPADGPVMQKKTVGWEPSTEKMIVRDGILEGDVTMYLKLEGGGNYRCEYRTIYKAKKDVKMPKSHFVEHTLVRNNIKKDAKGNTIELIEDASARY,alajgfp1,,517,509,,,,default,,,alajgfp1_default,,,,,,,,,,,,,,,,,,,,,,,,,,,,,,,b,,,,,,,,,,,,,,,,Q6R8F5,LBAXM
t,10.1021/bp034308g,AAS18271,2033714,alajGFP2,,,,,,,,,,,,MVLSKQMNMTYLMDGSVNGHNFTVEGEGDGKPYEGHQCLKLRITKGEPLPFAFDILTAAFCYGNRCFVNYPAEIADYFKQAFPEGLTWERSMTFEDGGFAAVSADLSLKNGNWFVHQSKFVGVNFPADGPVMQKKTVGWEPSTEKMIVRDGTLEGDVTMYLKLEGGGNYRCDYRTIYKAKKDVKMPKSHFVEHTLVRNNIKKDAKGNTIELIEDASARY,alajgfp2,,517,509,,,,default,,,alajgfp2_default,,,,,,,,,,,,,,,,,,,,,,,,,,,,,,,b,,,,,,,,,,,,,,,,Q6R8F4,RFJ23
t,10.1073/pnas.0502250102,,,amFP515,2A47,,,,,,,,,,,MALSNKFIGDDMKMTYHMDGCVNGHYFTVKGEGNGKPYEGTQTSTFKVTMANGGPLAFSFDILSTVFKYGNRCFTAYPTSMPDYFKQAFPDGMSYERTFTYEDGGVATASWEISLKGNCFEHKSTFHGVNFPADGPVMAKKTTGWDPSFEKMTVCDGILKGDVTAFLMLQGGGNYRCQFHTSYKTKKPVTMPPNHVVETRIARTDLDKGGNSVQLTEHAVAHITSVVPF,amfp515,,515,500,,,,default,,0.006,amfp515_default,,,,,,,,,,,,,,,,,,,,,,,,,,,,,,,b,,,,,,,,,,,,,,,,,8KFSR
t,10.3354/meps07588,ACH89428,15616242,amilFP512,,,,,,,,,,,,MSYSKQGIVQEMKTKYHMEGSVNGHEFTIEGVGTGYPYEGKQMSELVIIKPAGKPLPFSFDILSSVFQYGNRCFTKYPADMPDYFKQAFPDGMSYERSFLFEDGAVATASWKIRLEGNCFIHNSIFHGVNFPADGPVMKKKTIGWDKSFEKMTVSKEVLRGDVTMFLMLEGGGSHRCQFHSTYKTEKPVTLPPNHVVEHQIVRTDLGQSAKGFTVKLEAHAAAHVNPLKVK,amilfp512,,512,500,,,,default,,,amilfp512_default,,,,,,,,,,,,,,,,,,,,,,,,,,,,,,,b,,,,,,,,,,,,,,,,B5T1L4,Q3VS4
t,10.1002/jemt.20410,AAU06846,3620747,amilFP513,,,,,,,,,,,,MSYSKQGIVQEMKTKYHMEGSVNGHEFTIEGVGTGYPYEGKQMSELVIIKPAGKPLPFSFDILSSVFQYGNRCFTKYPADMPDYFKQAFPDGMSYERSFLFEDGAVATASWNIRLEGNCFIHKSIFHGVNFPADGPVMKKKTIDWDKSFEKMTVSKEVLRGDVTMFLMLEGGGSHRCQFHSTYKTEKPVTLPPNHVVEHQIVRTDLGQSAKGFTVKLEAHAAAHVNPLKVK,amilfp513,50.38,513,504,75200,,,default,,0.67,amilfp513_default,,,,,,,,,,,,,,,,,,,,,,,,,,,,,,,b,,,,,,,,,,,,,,,,Q66PV8,LO7EL
t,10.1002/jemt.20410,AAU06852,3620742,amilFP593,,,,,,,,,,,,MALSKHGLTKDMTMKYHMEGSVDGHKFVITGHGNGNPFEGKQTMNLCVVEGGPLPFSEDILSAAFDYGNRVFTEYPQGMVDFFKNSCPAGYTWHRSLLFEDGAVCTTSADITVSVEENCFYHNSKFHGVNFPADGPVMKKMTTNWEPSCEKIIPVPRQGILKGDIAMYLLLKDGGRYRCQFDTIYKAKSDPKEMPEWHFIQHKLTREDRSDAKNQKWQLVEHAVASRSALPG,amilfp593,44.54,593,562,90900,,,default,,0.49,amilfp593_default,,,,,,,,,,,,,,,,,,,,,,,,,,,,,,,b,,,,,,,,,,,,,,,,Q66PV2,VDDDT
t,10.3354/meps07588,ACH89429,15616243,amilFP597,,,,,,,,,,,,MALSKHGLTKDMTMKYHMEGSVDGHKFVITGHGNGNPFEGKQTVNLCVAEGGPLPFSEDILSAAFDYGNRVFTEYPQGMVDFFKNSCPAGYTWHRSLLFEDGAVCTTSADITVSVEENCFYHNSKFHGVNFPADGPVMKKMTTNWEPSCEKIIPVPRQGILKGDIAMYLLLKDGGRYRCQFDTIYKAKSDPKEMPEWHFIQHKLTREDRSDAKNQKWQLVEHAVASRSALPG,amilfp597,,597,558,,,,default,,,amilfp597_default,,,,,,,,,,,,,,,,,,,,,,,,,,,,,,,b,,,,,,,,,,,,,,,,B5T1L5,2YKB1
m,10.1093/molbev/msh079,AAR85352,1978504,anm2CP,,,,,,,,,,,,MEGGPALFQSDMTFKIFIDGVVNDQKFTIIADGSSKFPHGDFNVHAVCETGKLPMSWKPICHLIQYGEPFFAKYPNGISHFAQECFPEGLTIDRTVRFENDGTMTSHHTYELDGTCVISRITVNCDGFQPDGPIMKDQLVDILPTETHMFPHGSNAVRQLCYIGFTTADGGLMMSHFDSKLTFNGSRAIKIPGPHFVTVIIKQMKDTSDKRDHVCQREVTYAHSVPRITSAI,anm2cp,0.12,597,572,120000,,,default,,0.001,anm2cp_default,,,,,,,,,,,,,,,,,,,,,,,,,,,,,,,b,,,,,,,,,,,,,,,,Q6RYS4,SEJPD
t,10.1371/journal.pone.0002680,AAU06847,3620741,anobGFP,,,,,,,,,,,,MSYSKQGIAQEMKTKYHMEGSVNGHEFTIEGVGTGYPYEGKQMSELVIIKPAGKPLPFSFDILSSVFQYGNRCFTKYPADMPDYFKQAFPDGMSYERSFLFEDGAVATASWKIRLEGNCFIHNSIFNGVNFPADGPVMEKKTIGWDKSFEKMTVSKEVLRGDVTMFLMLEGGGSHRCQFHSTYKTEKPVTLPPNHVVEHQIVRTDLGQSAKGFTVKLEAHAAAHVNPLKVK,anobgfp,57.72,511,502,96200,,,default,,0.6,anobgfp_default,,,,,,,,,,,,,,,,,,,,,,,,,,,,,,,b,,,,,,,,,,,,,,,,Q66PV7,W1X8H
,10.1042/bj20051314,,,AQ14,,,,,,,,,,,,MASLVTEDMCIKMTMEGTVNGHHFKCVGEGEGKPFEGTQVEKIRITEGGPLPFAYDILAPCCMYGSKTFIKHVSGIPDYFKESFPEGFTWERTQIFEDGGSLTIHQDTSLQGNNFIFKVNVIGANFPANGPVMQKKTAGWEPSVEILYPRDGVLCGQALMALKCTDGNHLTSHLRTTYRSRKPSNAVNMPEFHFGDHRIEILKAEQGKFYEQYESAVARYCEAAPSKLGHH,aq14,,663,595,,,,default,,,aq14_default,,,,,,,,,,,,,,,,,,,,,,,,,,,,,,,b,,,,,,,,,,,,,,,,,WBK4U
t,10.1042/bj20051314,,,AQ143,,,,,,,,,,,,MAPLVTEDMCIKMTMEGTINGHHFKCVGEGEGKPFEGTQVEKIRITEGGPLPFAYDILAPCCMYGSKTFIKHVSGIPDYFKESFPEGFTWERTQIFEDGGSLTIHQDTSLQGNNFIFKVNVIGANFPANGPVMQKKTAGWEPSVEILYPRDGVLCGQALMALKCTDGDHLTSHLRTTYRSRKPSNAVNMPEFHFGDHRIEILKAEQGKFYEQYESAVARYCEAAPSKLGHH,aq143,3.6,655,595,90000,,,default,,0.04,aq143_default,,,,,,,,,,,,,,,,,,,,,,,,,,,,,,,b,,,,,,,,,,,,,,,,,GW5EB
t,10.1073/pnas.97.26.14091,AAG41206,1236053,asCP562,,,,,,,,,,,,MASFLKKTMPFKTTIEGTVNGHYFKCTGKGEGNPFEGTQEMKIEVIEGGPLPFAFHILSTSCMYGSKTFIKYVSGIPDYFKQSFPEGFTWERTTTYEDGGFLTAHQDTSLDGDCLVYKVKILGNNFPADGPVMQNKAERWEPATEILYEVDGVLRGQSLMALKCPGGRHLTCHLHSTYRSKKPASALKMPGFHFGDHRIEIMEEVEKGKCYKQYEAAVARYCDAAPSKLGHH,ascp562,,595,562,,,,default,,,ascp562_default,,,,,,,,,,,,,,,,,,,,,,,,,,,,,,,b,,,,,,,,,,,,,,,,Q9GPI5,3NV4W
t,10.1042/bj20051314,,,AsRed2,,,,,,,,,,,,MASLLKKTMPFRTTIEGTVNGHYFKCTGKGEGNPLEGTQEMKIEVIEGGPLPFAFHILSTSCMYGSKAFIKYVSGIPDYFKQSLPEGFTWERTTTYEDGGFLTAHQDTSLDGDCLVYKVKILGNNFPADGPVMQNKAGRWEPSTEIVYEVDGVLRGQSLMALECPGGRHLTCHLHTTYRSKKPASALKMPGFHFEDHRIEILEEVEKGKCYKQYEAAVGRYCDAAPSKLGH,asred2,2.81,592,576,56200,,,default,,0.05,asred2_default,,,,,,,,,,,,,,,,,,,,,,,,,,,,,,,b,,,,,,,,,,,,,,,,,8TL1P
,10.1074/jbc.c000338200,AAG02385,514601,asulCP,1XQM,,,,,,,,,,,MASFLKKTMPFKTTIEGTVNGHYFKCTGKGEGNPFEGTQEMKIEVIEGGPLPFAFHILSTSCMYGSKTFIKYVSGIPDYFKQSFPEGFTWERTTTYEDGGFLTAHQDTSLDGDCLVYKVKILGNNFPADGPVMQNKAGRWEPATEIVYEVDGVLRGQSLMALKCPGGRHLTCHLHTTYRSKKPASALKMPGFHFEDHRIEIMEEVEKGKCYKQYEAAVGRYCDAAPSKLGHN,asulcp,0.12,595,572,120000,,,default,,0.001,asulcp_default,,,,,,,,,,,,,,,,,,,,,,,,,,,,,,,b,,,,,,,,,,,,,,,,Q9GZ28,M3FBS
,10.1016/s1096-4959(02)00025-8,BAM08940,27425393,atenFP,,,,,,,,,,,,MRTKYHMEGSVNGHEFTIEGVGTGNPYEGTQTAELVIIKPVGKPLPFSFDILSSVFQYGNLCFTKYPADMTDYFKQAFPAGMSYERSFLFEDGAVATASWNIRLEGNCFIHNSIFHGVNFPADGPVMKKKTIGWDKSFQKMTVSKEVLRGDLAMFLLLEGGGYHRCQFHSTYKTERPVTLPPNHVVEHQIVRTDLGQSAKGFTVKLEEHAAAHVNPLKVK,atenfp,,515,504,,,,default,,,atenfp_default,,,,,,,,,,,,,,,,,,,,,,,,,,,,,,,b,,,,,,,,,,,,,,,,I0IUJ1,J9SCM
,10.1093/emboj/20.21.5853,,,avGFP523,1H6R,,,,,,,,,,,,avgfp523,,523,512,,,,default,6.05,,avgfp523_default,,,,,,,,,,,,,,,,,,,,,,,,,,,,,,,b,,,,,,,,,,,,,,,,,WPR7G
,10.1101/677344,,,AvicFP4,,,,,,,,,,,,MDSGALLFKQKIPLVVEFEGDVEGMKFSVRGKGHGDATNGRIEASFICTTGELPVPWSSIISSLTYGFLCFTKYPDGIKDFPKSAMPEGYVQERTISFENDGTYKTRAEVTFENGSVYNRVKLNGEGFNKGGNILGKKLEYSFNPHCIYVLGDKENNGIRCCFNVVHNIVGGGQLIASHSQLNTPLGGGPIAIPEYHHICNHTTLSKDPREPRDHMTVAEVLKAVDCKTAYL,avicfp4,12.1,512,500,121000,,,default,,0.1,avicfp4_default,,,,,,,,,,,,,,,,,,,,,,,,,,,,,,,b,,,,,,,,,,,,,,,,,LTRTO
d,10.1038/srep05469,,,bfloGFPa1,,,,,,,,,,,,MPLPATHDIHLHGSINGHEFDMVGGGKGDPNAGSLVTTAKSTKGALKFSPYLMIPHLGYGYYQYLPYPDGPSPFQTSMLEGSGYAVYRVFDFEDGGKLTTEFKYSYEGSHIKADMKLMGSGFPDDGPVMTSQIVDQDGCVSKKTYLNNNTIVDSFDWSYNLQNGKRYRARVSSHYIFDKPFSADLMKKQPVFVYRKCHVKASKTEVTLDEREKAFYELA,bflogfpa1,120.9,512,500,120900,,,default,3.0,1.0,bflogfpa1_default,,,,,,,,,,,,,,,,,,,,,,,,,,,,,,,b,,,,,,,,,,,,,,,,,6BXQP
t,10.1007/s10126-007-9072-7,AAZ14788,4535146,ccalGFP1,,,,,,,,,,,,MSLSKQVVKEDMKMTYHMDGCVNGHYFTIEGEGTGKPFKGQKTLKLRVTEGGPLPFAFDILSATFTYGNRCFCDYPEDMPDYFKQSLPEGYSWERTMMYEDGACGTASAHISLDKNGFVHNSTFHGVNFPANGPVMKKKGVNWEPSSEKITACDGILKGDVTMFLVLEGGHRLKCLFQTTYKADKVVKMPPNHIIEHRLVRSEDGDAVQIQEHAVAKYFTV,ccalgfp1,35.88,517,504,78000,,,default,,0.46,ccalgfp1_default,,,,,,,,,,,,,,,,,,,,,,,,,,,,,,,b,,,,,,,,,,,,,,,,Q1ALD4,T41NE
t,10.1007/s10126-007-9072-7,ABI58282,6067037,ccalGFP3,,,,,,,,,,,,MSLSKQVVKQDMNMTYHMDGCVNGHSFTIEGEGRGNPFKGQQTLKLRVTKGGPLPFAFDILSATFTYGNRCFCDYPEDMPDYFKQSLPEGYSWERTMMYEDGGCGTASAHISLNKTGFVHKSTFHGVNFPANGPVMQRKTVNWEPSTEKITACDGTLKGDVTMFLLLGGGYQQKCQFQTTYRTDKTVKMPPNHIIEHRLVRSEDGDAVQIQEHAVAKYFTV,ccalgfp3,69.12,517,505,144000,,,default,,0.48,ccalgfp3_default,,,,,,,,,,,,,,,,,,,,,,,,,,,,,,,b,,,,,,,,,,,,,,,,Q09HR5,UHFSE
t,10.1007/s10126-007-9072-7,AAZ14789,4535492,ccalOFP1,,,,,,,,,,,,MSLSKQVLPRDVKMRFHMDGCVNGHSFTIEGEGTGKPYEGKKTLKLRVTKGGPLPFAFDILSATFTYGNRCFCDYPEEMPDYFKQSLPEGYSWERTMMYEDGACSTASAHISLDKDCFIHNSTFHGVNFPANGPVMQKKAMNWEPSSELITPCDGILKGDVTMFLLQEGGHRHKCQFTTSYKAHKAVKIPPNHIIEHRLVRKEVGDAVQIQEHAVAKHFTVQIKEA,ccalofp1,44.2,561,508,85000,,,default,,0.52,ccalofp1_default,,,,,,,,,,,,,,,,,,,,,,,,,,,,,,,b,,,,,,,,,,,,,,,,Q1ALD3,5YBHO
t,10.1007/s10126-007-9072-7,AAZ67342,4620339,ccalRFP1,,,,,,,,,,,,MSLSKQVLPRDVKMRYHMDGCVNGHQFIIEGEGTGKPYEGKKILELRVTKGGPLPFAFDILSSVFTYGNRCFCEYPEDMPDYFKQSLPEGHSWERTLMFEDGGCGTASAHISLDKNCFVHKSTFHGVNFPANGPVMQKKTLNWEPSSELITAGDGILKGDVTMFLMLEGGHRLKCQFTTSYKAKKAVKMPPNHIIEHRLVRKEVADAVQIQEHAVAKHFIV,ccalrfp1,54.28,598,568,92000,,,default,,0.59,ccalrfp1_default,,,,,,,,,,,,,,,,,,,,,,,,,,,,,,,b,,,,,,,,,,,,,,,,Q2VTM9,T44E8
t,10.1007/s10126-007-9072-7,AAZ67343,4620335,ccalYFP1,,,,,,,,,,,,MSHSKQVITQEMKMVYHMDGCVNGHSFTIEGEGTGKPYEGNQTLKLRVTKGGPLPFAFDILTATFCYGNRCFCEYPEDMPDYYKQSFPEGYSFERTMMFEDGACCTTSVHLSLTKNCFVHNSTFHGVNFPANGPVMQKKTLNWEPSSEKITPFEGNLKGDVTMFLKLEGGQQHRCQFQTTYKAHKAVKMPPNHIIEHRLVRSQDGDAVQLKEHAVAKCFTA,ccalyfp1,106.5,523,514,142000,,,default,,0.75,ccalyfp1_default,,,,,,,,,,,,,,,,,,,,,,,,,,,,,,,b,,,,,,,,,,,,,,,,Q2VTM8,WVV8W
m,10.1371/journal.pone.0037551,,,cgfmKate2,,,,,,,,,,,,MVSELIKENMHMKLYMEGTVNNHHFKATSEGEGKPYEGTQTMRIKAVEGGPLPFAFDILATSFMYGSKTFINHTQGIPDFFKQSFPEGFTWERVTTYEDGGVLTATQDTSLQDGMLIYNVKIRGVNFPSNGPVMQKKTLGWEASTETLYPADGGLEGRADMALKLVGGGHLIANLKTTYRSKKPAKNLKMPGVYYVDRRLERIKEADKETYVEQHEVAVARYSDLPSKLGHR,cgfmkate2,25.85,628,584,55000,,,default,4.6,0.47,cgfmkate2_default,,,,,,,,,,,,,,,,,,,,,,,,,,,,,,,b,,,,,,,,,,,,,,,,,2D7XF
m,10.1371/journal.pone.0037551,,,cgfTagRFP,,,,,,,,,,,,MSELIKENMHMKLYMEGTVNNHHFKATSEGEGKPYEGTQTMRIKVVEGGPLPFAFDILATSFMYGSRTFINHTQGIPDFFKQSFPEGFTWERVTTYEDGGVLTATQDTSLQDGMLIYNVKIRGVNFPSNGPVMQKKTLGWEANTEMLYPADGGLEGRSDMALKLVGGGHLIVNFKTTYRSKKPAKNLKMPGVYYVDHRLERIKEADKETYVEQHEVAVARYSDLPSKLGHK,cgftagrfp,45.9,585,556,90000,,,default,2.9,0.51,cgftagrfp_default,,,,,,,,,,,,,,,,,,,,,,,,,,,,,,,b,,,,,,,,,,,,,,,,,G9U12
wd,10.1074/jbc.m102815200,,,Citrine,1HUY,3DPW,,,,,,,,,,MVSKGEELFTGVVPILVELDGDVNGHKFSVSGEGEGDATYGKLTLKFICTTGKLPVPWPTLVTTFGYGLMCFARYPDHMKQHDFFKSAMPEGYVQERTIFFKDDGNYKTRAEVKFEGDTLVNRIELKGIDFKEDGNILGHKLEYNYNSHNVYIMADKQKNGIKVNFKIRHNIEDGSVQLADHYQQNTPIGDGPVLLPDNHYLSYQSALSKDPNEKRDHMVLLEFVTAAGITLGMDELYK,citrine,58.52,529,516,77000,3.6,,default,5.7,0.76,citrine_default,,,,,,,,,,,,,,,,,,,,,,,,,,,,,,,b,,,,,,,,,,,,,,,,,VR7EN
d,10.1039/c8ib00063h,,,Citrine2,,,,,,,,,,,,MVSKGEELFTGVVPILVELDGDVNGHKFSVTGEGEGDATYGKLTLKFICTTGKLPVPWPTLVTTFGYGLTCFARYPDHMKQHDFFKSAMPEGYVQERTIFFKDDGNYKTRAEVKFEGDTLVNRIELKGIDFKEDGNILGHKLEYNHNSHYVYIMADKQKNGIKANFKIRHNIEDGSVQLADHYQQNTPIGDGPVLLPDNHYLSYQSQLSKDPNEERDHTVLLEFVTAAGITLGMGELYK,citrine2,68.6,522,509,98000,3.3,,default,5.9,0.7,citrine2_default,,,,,,,,,,,,,,,,,,,,,,,,,,,,,,,b,,,,,,,,,,,,,,,,,ZWH88
wd,10.1038/nmeth.2171,AFR60231,30275454,Clover,5WJ2,,,,,,,,,,,MVSKGEELFTGVVPILVELDGDVNGHKFSVRGEGEGDATNGKLTLKFICTTGKLPVPWPTLVTTFGYGVACFSRYPDHMKQHDFFKSAMPEGYVQERTISFKDDGTYKTRAEVKFEGDTLVNRIELKGIDFKEDGNILGHKLEYNFNSHNVYITADKQKNGIKANFKIRHNVEDGSVQLADHYQQNTPIGDGPVLLPDNHYLSHQSALSKDPNEKRDHMVLLEFVTAAGITHGMDELYK,clover,84.36,515,505,111000,3.2,30.0,default,6.2,0.76,clover_default,,,,,,,,,,,,,,,,,,,,,,,,,,,,,,,b,,,,,,,,,,,,,,,,,4Z641
,10.1074/jbc.m102815200,,,cpCitrine,,,,,,,,,,,,DPMVSKGEELFTGVVPILVELDGDVNGHKFSVSGEGEGDATYGKLTLKFILTTGKLPVPWPTLVTTFGYGLMVFARYPDHMKRHDFFKSAMPEGYVQERTIFFKDDGNYKTRAEVKFEGDTLVNRIELKGIDFKEDGNILGHKLEYNYNSHNVYIMADKQKNGIKVNFKIRHNIEDGSVQLADHYQQNTPIGDGPVLLPDNHYLSYQSALSKDPNEKRDHMVLLEFVTAAGITHGMDELYK,cpcitrine,2.0,524,506,20000,,,default,,0.1,cpcitrine_default,,,,,,,,,,,,,,,,,,,,,,,,,,,,,,,b,,,,,,,,,,,,,,,,,9PBZV
m,10.1371/journal.pone.0020505,,,cp-mKate,3RWA,,,,,,,,,,,GHLICNLKTTYRSKKPAKNLKMPGVYYVDRRLERIKEADKETYVEQHEVAVARYCDLPSKLGHAGGTGGSMSELITENMHMKLYMEGTVNNHHFKCTSEGEGKPYEGTQTMRIKVVEGGPLPFAFDILATSFMYGSKTFINHTQGIPDFFKQSFPEGFTWERVTTYEDGGVLTATQDTSLQDGCLIYNVKIRGVNFPSNGPVMQKKTLGWEASTEMLYPADGGLEGRSDMALKLV,cp-mkate,,620,588,,,,default,,0.33,cp-mkate_default,,,,,,,,,,,,,,,,,,,,,,,,,,,,,,,b,,,,,,,,,,,,,,,,,2EM4B
d,10.1038/nmeth.4046,AOY07766,,CyRFP1,,,,,,,,,,,,MVSKGEELIKENMRSKLYLEGSVNGHQFKCTHEGEGKPYEGKQTNRIKVVEGGPLPFAFDILATMFMYGSKVFIKYPADLPDYFKQSFPEGFTWERVMVFEDGGVLTATQDTSLQDGELIYNVKLRGVNFPANGPVMQKKTLGWEPSTETMYPADGGLEGRCDKALKLVGGGHLHVNFKTTYKSKKPVKMPGVHYVDRRLERIKEADNETYVEQYEHAVARYSNLGGGMDELYK,cyrfp1,36.48,588,529,48000,,12.0,CyRFP1,,0.76,cyrfp1_cyrfp1,,,,,,,,,,,,,,,,,,,,,,,,,,,,,,,,,,,,,,,,,,,,,,,,A8RF9
d,10.1073/pnas.0403668101,,,d1EosFP,,,,,,,,,,,,MSAIKPDMKINLRMEGNVNGHHFVIDGDGTGKPFEGKQSMDLEVKEGGPLPFAFDILTTAFHYGNRVFAEYPDHIQDYFKQSFPKGYSWERSLTFEDGGICIARNDITMEGDTFYNKVRFHGTNFPANGPVMQKKTLKWEPSTEKMYVRDGVLTGDITMALLLEGNAHYRCDFRTTYKAKEKGVKLPGYHFVDHCIEILSHDKDYNKVKLYEHAVAHSGLPDNARR,d1eosfp,50.86,516,505,74800,,,Green,,0.68,d1eosfp_green,24.8,581,571,40000,,,Red,,0.62,d1eosfp_red,,,,,,,,,,,,,,,,,,,,,pc,d1eosfp_green,d1eosfp_red,405,,,,,,,,,,,,,,YLRRG
d,10.1073/pnas.0403668101,,,d2EosFP,,,,,,,,,,,,MSAIKPDMKINLRMEGNVNGHHFVIDGDGTGKPFEGKQSMDLEVKEGGPLPFAFDILTTAFHYGNRVFAEYPDHIQDYFKQSFPKGYSWERSLTFEDGGICIARNDITMEGDTFYNKVRFHGVNFPANGPVMQKKTLKWEPSTEKMYVRDGVLTGDIHMALLLEGNAHYRCDFRTTYKAKEKGVKLPGYHFVDHCIEILSHDKDYNKVKLYEHAVAHSGLPDNARR,d2eosfp,55.44,516,506,84000,,,Green,,0.66,d2eosfp_green,19.8,581,569,33000,,,Red,,0.6,d2eosfp_red,,,,,,,,,,,,,,,,,,,,,pc,d2eosfp_green,d2eosfp_red,405,,,,,,,,,,,,,,1SEDF
,10.1021/bi026609p,,,deGFP1,1JBZ,1JBY,,,,,,,,,,MSKGEELFTGVVPILVELDGDVNGHKFSVSGEGEGDATYGKLTLKFICTTGKLPVPWPTLVTTFTYGVQCFSRYPDHMKRHDFFKSAMPEGYVQERTIFFKDDGNYKTRAEVKFEGDTLVNRIELKGIDFKEDGNILGHKLEYNYNSGNVYIMADKQKNGIKVNFKIRHNIEDGSVQLADHYQQNTPIGDGPVLLPDNHYLSCQSALSKDPNEKRDHMVLLEFVTAAGITHGMDELYK,degfp1,4.59,516,504,28700,,,default,8.02,0.16,degfp1_default,,,,,,,,,,,,,,,,,,,,,,,,,,,,,,,b,,,,,,,,,,,,,,,,,THWKH
,10.1021/bi026609p,,,deGFP3,,,,,,,,,,,,MSKGEELFTGVVPILVELDGDVNGHKFSVSGEGEGDATYGKLTLKFICTTGKLPVPWPTLVTTFTYGVQCFSRYPDHMKQHDFFKSAMPEGYVQERTIFFKDDGNYKTRAEVKFEGDTLVNRIELKGIDFKEDGNILGHKLEYNYNSHNVYIMADKQKNGIKVNFKIRHNIEDGSVQLADHYQQNTPIGDGPVLLPDNHYLSCQSALSKDPNEKRDHMVLLEFVTAAGITHGMDELYK,degfp3,5.07,518,508,26700,,,default,6.86,0.19,degfp3_default,,,,,,,,,,,,,,,,,,,,,,,,,,,,,,,b,,,,,,,,,,,,,,,,,B72B1
,10.1021/bi026609p,,,deGFP4,,,,,,,,,,,,MSKGEELFTGVVPILVELDGDVNGHKFSVSGEGEGDATYGKLTLKFISTTGKLPVPWPTLVTTFTYGVQCFSRYPDHMKQHDFFKSAMPEGYVQERTIFFKDDGNYKTRAEVKFEGDTLVNRIELKGIDFKEDGNILGHKLEYNYNSCNVYIMADKQKNGIKVNFKIRHNIEDGSVQLADHYQQNTPIGDGPVLLPDNHYLSCQSALSKDPNEKRDHMVLLEFVTAAGITHGMDELYK,degfp4,4.04,518,509,26900,,,default,7.37,0.15,degfp4_default,,,,,,,,,,,,,,,,,,,,,,,,,,,,,,,b,,,,,,,,,,,,,,,,,LDZC9
m,10.1038/nbt1191,,,Dendra,,,,,,,,,,,,MNLIKEDMRVKVHMEGNVNGHAFVIEGEGKGKPYEGTQTANLTVKEGAPLPFSYDILTTAVHYGNRVFTKYPEDIPDYFKQSFPEGYSWERTMTFEDKGICTIRSDISLEGDCFFQNVRFKGTNFPPNGPVMQKKTLKWEPSTEKLHVRDGLLVGNINMALLLEGGGHYLCDFKTTYKAKKVVQLPDAHFVDHRIEILGNDSDYNKVKLYEHAVARYSPLPSQAW,dendra,14.7,505,488,21000,,,Green,6.6,0.7,dendra_green,14.4,575,556,20000,,,Red,6.9,0.72,dendra_red,,,,,,,,,,,,,,,,,,,,,pc,dendra_green,dendra_red,405,,,,,,,,,,,,,,GJDTN
m,10.1016/j.chembiol.2011.08.007,,,Dendra2-M159A,,,,,,,,,,,,MNTPGINLIKEDMRVKVHMEGNVNGHAFVIEGEGKGKPYEGTQTANLTVKEGAPLPFSYDILTTAVHYGNRVFTKYPEDIPDYFKQSFPEGYSWERTMTFEDKGICTIRSDISLEGDCFFQNVRFKGTNFPPNGPVMQKKTLKWEPSTEKLHVRDGLLVGNINAALLLEGGGHYLCDFKTTYKAKKVVQLPDAHFVDHRIEILGNDSDYNKVKLYEHAVARYSPLPSQVW,dendra2-m159a,,,,,,,Green (off),,,dendra2-m159a_green-off,,,,,,,Orange (off),,,dendra2-m159a_orange-off,28.11,504,471,51100,2.8,,Green,6.5,0.55,dendra2-m159a_green,33.75,562,528,45000,4.0,,Orange,6.8,0.75,dendra2-m159a_orange,mp,dendra2-m159a_orange-off,dendra2-m159a_orange,440,dendra2-m159a_orange,dendra2-m159a_orange-off,561,dendra2-m159a_green-off,dendra2-m159a_green,405,dendra2-m159a_green,dendra2-m159a_green-off,488,dendra2-m159a_green,dendra2-m159a_orange,405,,CQ4QL
m,10.1021/jacs.5b09923,,,Dendra2-T69A,,,,,,,,,,,,MNTPGINLIKEDMRVKVHMEGNVNGHAFVIEGEGKGKPYEGTQTANLTVKEGAPLPFSYDILTTAVHYGNRVFAKYPEDIPDYFKQSFPEGYSWERTMTFEDKGICTIRSDISLEGDCFFQNVRFKGTNFPPNGPVMQKKTLKWEPSTEKLHVRDGLLVGNINMALLLEGGGHYLCDFKTTYKAKKVVQLPDAHFVDHRIEILGNDSDYNKVKLYEHAVARYSPLPSQVW,dendra2-t69a,23.8,518,502,42500,3.0,,Green,6.0,0.56,dendra2-t69a_green,22.66,578,563,35400,4.2,,Orange,7.0,0.64,dendra2-t69a_orange,,,,,,,,,,,,,,,,,,,,,pc,dendra2-t69a_green,dendra2-t69a_orange,405,,,,,,,,,,,,,,XKDOQ
d,10.1016/j.chembiol.2017.12.005,BBC28143,,dfGFP,,,,,,,,,,,,MASGRALFQYPMTSKIELNGEINGKKFKVAGEGFTPNSGRFNMHAYCTTGDLPMSWVVIASPLQYGFHMFAHYPEDITHFFQECFPGSYTLDRTLRMEGDGTLTTHHEYSLKDGCVTSKTTLNASGFDPKGATMTKSFVEQLPNQVEIFAEGNGIRLLSHVPYLKKDGTIQIGYQDCIVKPVGGKKVTQPKYHFLHTQIIQKKDPNDTRDHIVQTELAVAGNPWHEPSASAV,dfgfp,,524,505,,,,default,3.8,,dfgfp_default,,,,,,,,,,,,,,,,,,,,,,,,,,,,,,,b,,,,,,,,,,,,,,,,,P2PV8
d,10.1073/pnas.082243699,,,dimer1,,,,,,,,,,,,MVASSEDVIKEFMRFKVRMEGSVNGHEFEIEGEGEGRPYEGTQTAKLKVTKGGPLPFAWDILSPQFQYGSKVYVKHPADIPDYKKLSFPEGFKWERVMNFEDGGVVTVTQDSSLQDGCFIYKVKFRGVNFPSDGPVMQKKTMGWEASTERLYPRDGVLKGEIHQALKLKDGGHYLVEFKTIYMAKKPVQLPGYYYVDTKLDITSHNEDYTIVEQYERAEGRHHLFL,dimer1,,579,551,,,,default,,,dimer1_default,,,,,,,,,,,,,,,,,,,,,,,,,,,,,,,b,,,,,,,,,,,,,,,,,ZC4KN
d,10.1073/pnas.082243699,AAM54542,142581,dimer2,,,,,,,,,,,,MVASSEDVIKEFMRFKVRMEGSVNGHEFEIEGEGEGRPYEGTQTAKLKVTKGGPLPFAWDILSPQFQYGSKAYVKHPADIPDYKKLSFPEGFKWERVMNFEDGGVVTVTQDSSLQDGTLIYKVKFRGTNFPPDGPVMQKKTMGWEASTERLYPRDGVLKGEIHQALKLKDGGHYLVEFKTIYMAKKPVQLPGYYYVDTKLDITSHNEDYTIVEQYERSEGRHHLFL,dimer2,47.61,579,552,69000,,120.0,default,4.9,0.69,dimer2_default,,,,,,,,,,,,,,,,,,,,,,,,,,,,,,,b,,,,,,,,,,,,,,,,,DFXUK
,10.1073/pnas.062552299,AAG16224,967803,dis2RFP,,,,,,,,,,,,MSCSKNVIKEFMRFKVRMEGTVNGHEFEIKGEGEGRPYEGHCSVKLMVTKGGPLPFAFDILSPQFQYGSKVYVKHPADIPDYKKLSFPEGFKWERVMNFEDGGVVTVSQDSSLKDGCFIYEVKFIGVNFPSDGPVMQRRTRGWEASSERLYPRDGVLKGDIHMALRLEGGGHYLVEFKSIYMVKKPSVQLPGYYYVDSKLDMTSHNEDYTVVEQYEKTQGRHHPFIKPLQ,dis2rfp,,593,573,,,,default,,,dis2rfp_default,,,,,,,,,,,,,,,,,,,,,,,,,,,,,,,b,,,,,,,,,,,,,,,,Q9GTJ7,ORVNV
,10.1073/pnas.062552299,AAM10627,1067021,dis3GFP,,,,,,,,,,,,MSALKEEMKINLTMEGVVNGLPFKIRGDGKGKPYQGSQELTLTVVKGGPLPFSYDILTTMFQYGNRAFVNYPEDIPDIFKQTCSGPNGGYSWQRTMTYEDGGVCTATSNISVVGDTFNYDIHFMGANFPLDGPVMQKRTMKWEPSTEIMFERDGMLRGDIAMSLLLKGGGHYRCDFETIYKPNKVVKMPDYHFVDHCIEITSQQDYYNVVELTEVAEARYSSLEKIGKSKA,dis3gfp,,512,503,,,,default,,,dis3gfp_default,,,,,,,,,,,,,,,,,,,,,,,,,,,,,,,b,,,,,,,,,,,,,,,,Q8T6T8,D41LA
d,10.1038/nmeth.2413,,,dLanYFP,,,,,,,,,,,,MVSKGEEDNMASLPATHELHIFGSFNGVDFDMVGRGTGNPNDGYEELNLKSTKGDLQFSPWILVPQIGYGFHQYLPFPDGMSPFQAAMKDGSGYQVHRTMQFEDGASLTSNYRYTYEGSHIKGEFQVKGTGFPADGPVMTNSLTAADWCVTKMLYPNDKTIISTFDWTYTTGNGKRYQSTARTTYTFAKPMAANILKNQPMFVFRKTELKHSKTELNFKEWQKAFTDVMGMDELYK,dlanyfp,112.5,524,513,125000,3.1,,default,3.9,0.9,dlanyfp_default,,,,,,,,,,,,,,,,,,,,,,,,,,,,,,,b,,,,,,,,,,,,,,,,,SKHT2
m,10.1038/nbt.1952,,,Dreiklang,3ST3,3ST2,,3ST4,,,,,,,,MVSKGEELFTGVVPILVELDGDVNGHKFSVSGEGEGDATYGKLTLKFICTTGKLPVPWPTLLTTIGYGLMCFARYPDHMKQHDFFKSAMPEGYVQERTIFFKDDGNYKTRAEVKFEGDTLVNRIELKGIDFKEDGNILGHKLEYNHDSHNVYIMADKQKNGIKVNFKIRHNIEDGSVQLADHYQQNTPIGDGPVLLPDNHYLSYQSALSKDPNEKRDHMVLLEFVTAAGITLGMDELYK,dreiklang,34.03,529,511,83000,,120.0,On,7.2,0.41,dreiklang_on,,,,,,,Off,,,dreiklang_off,,,,,,,,,,,,,,,,,,,,,ps,dreiklang_on,dreiklang_off,405,dreiklang_off,dreiklang_on,365,,,,,,,,,,,JY7XC
d,10.1016/j.chembiol.2008.02.008,,,d-RFP618,,,,,,,,,,,,MNSLIKENMRMMVVMEGSVNGYQFKCTGEGDGNPYMGTQTMRIKVVEGGPLPFAFDILATSFMYGSKTFIKHTKGIPDFFKQSFPEGFTWERVTRYEDGGVFTVMQDTSLEDGCLVYHAKVRGVNFPSNGAVMQKKTKGWEPSTEMLYPADGGLRGYSQMALNVDGGGYLFCSFETTYRSKKTDENFKMPGFHFVDHRLERLEESDKEMFVVQHEHAVAKFCDLPSKLGRL,d-rfp618,,618,560,,,480.0,default,,0.35,d-rfp618_default,,,,,,,,,,,,,,,,,,,,,,,,,,,,,,,b,,,,,,,,,,,,,,,,,GZCBS